{"text_format":"1","workbook":"xlsx","n_sheets":17,"sheets":["Input","Restripe-PCC","Restripe-AC","New Stripe-PCC","New Stripe-AC","Results","tape","thermoplastic (90 mil)","thermoplastic (40 mil)","inverted","Factor Results","Factors for Restripe-PCC","Intermediate Factor Output","Factors for New Stripe-PCC","Factors for Restripe-AC","Factors for New Stripe-AC","Equivalent Cost Factors"],"not_rendered":{"charts":108,"images":24,"macros":1,"external_links":0,"defined_names":2,"comments":5,"pivot_tables":0},"unopened":[],"bounds":{"document_bytes":16777216,"sheet_cells":100000,"rows_first":2000,"rows_last":500,"rows_between":2000,"halvings":0,"cell_chars":16384,"cell_head_chars":4096},"cells_cut":0,"cells_raw":0,"read":"whole","date_system":"1900"}

{"sheet":"Input","index":0,"n_rows":33,"n_cols":13,"rows_kept":33,"cut":false,"hidden":false,"merged":[[19,5,21,5],[25,9,25,10],[25,8,26,8],[25,11,25,12],[16,1,16,2],[16,9,16,10],[16,11,16,12],[16,3,16,4],[8,9,8,10],[8,11,8,12]]}
["INPUT WORKSHEET",null,null,null,null,null,null,null,"PCC","Restripe",15,2]
[null,null,null,null,null,null,null,null,"AC","New Stripe",15,3]
["1.     General Information"]
["    Pavement Surface Type","PCC",null,null,null,null,null,null,"No"]
["    Restripe/New Stripe","New Stripe"]
["2.    Traffic Options (ADT per Lane)"]
["(5000, 10000, 15000, 20000, and 25000 are defaults)"]
["Additional ADT Value for Analysis (To assign a different ADT, first click No, then Yes again)","No",null,null,null,null,null,null,"Default Values for AC"]
["3.    Analysis Options",null,null,null,null,null,null,null,null,"application only",null,"removal"]
["    Minimum Effective Retroreflectivity (white)",100,null,null,null,null,null,null,null,"solid","dash","solid","dash"]
["    Minimum Effective Retroreflectivity (yellow)",100,null,null,null,null,null,null,"40 mil",1039,391,0,0]
["    Maximum Effective Retroreflectivity",200,null,null,null,null,null,null,"90 mil",2458,817,0,0]
["    Remaining Pavement Service Life (Month)",100,null,null,null,null,null,null,"tape",8108,3861,5250,5250]
["4.     Application/Removal Costs",null,null,null,null,null,null,null,"inverted",5270,2505,5250,5250]
["    Please Input Cost Values in the Table"]
["    Or Use the Provided Default Values",null,null,null,null,null,null,null,"Default Values for PCC"]
[null,"Average Application Cost Per Mile ($)",null,"Average Removal Cost Per Mile ($)",null,null,null,null,null,"application only",null,"removal"]
["Material","Solid","Dash","Solid","Dash",null,null,null,null,"solid","dash","solid","dash"]
["    40 Mil",1039,391,5250,5250,{"$f":"IF(MIN(MaterialCosts)<0,\"Cost should be a positive number !\",\"\")","v":""},null,null,"40 mil",1039,391,5250,5250]
["    90 Mil",2458,817,5250,5250,{"$f":"(IF(ISNUMBER(B19)*ISNUMBER(C19)* ISNUMBER(D19)*ISNUMBER(E19)* ISNUMBER(B20)*ISNUMBER(C20)* ISNUMBER(D20)*ISNUMBER(E20)* ISNUMBER(B21)*ISNUMBER(C21)* ISNUMBER(D21)*ISNUMBER(E21)* ISNUMBER(B22)*ISNUMBER(C22)* ISNUMBER(D22)*ISNUMBER(E22),\" \",\"Cost should not be text or left blank !  If the material is not part of the analysis, keep the default values so that graphics will be properly presented.\"))","v":" "},null,null,"90 mil",2458,817,5250,5250]
["    Tape",8108,3861,5250,5250,null,null,null,"tape",8108,3861,5250,5250]
["    Inverted",5270,2505,5250,5250,null,null,null,"inverted",5270,2505,5250,5250]
["    % Decrease for Off-Peak Application Cost",15]
["    % Increase for Night Time Application Cost",15]
["5.     User Cost Due to Lane Closure"]
["    Number of Lanes in One Direction","2",null,null,null,null,null,null,"ADT/Lane","2 Lanes",null,"3 Lanes"]
["    Please Input Cost Values in the Table","ADT/Lane","Off-Peak ($/mile)","Night Time ($/mile)",null,null,null,null,null,"Off-Peak ($/mile)","Night Time ($/mile)","Off-Peak ($/mile)","Night Time ($/mile)"]
["    Or Use the Provided Default Values",5000,70.526903758950084,20.227999999999998,null,{"$f":"IF(MIN(UserCosts)<0,\"Cost should be a positive number !\",\"\")","v":""},null,null,5000,{"$f":"IF(I28<=12500,38.9*EXP(0.119*I28/1000),27.34*EXP(0.306*I28/1000))","v":70.526903758950084},{"$f":"IF(I28<25000,3.93*I28/1000+0.578,2/(10^14)*EXP(1.516*I28/1000))","v":20.227999999999998},{"$f":"IF(I28<=19000,69.37*EXP(0.093*I28/1000),0.48*EXP(0.438*I28/1000))","v":110.43802428309822},{"$f":"IF(I28<25000,5.675*I28/1000+3.713,2/(10^12)*EXP(1.32*I28/1000))","v":32.088000000000001}]
[null,10000,127.86745896720328,39.878,null,{"$f":"(IF(ISNUMBER(C28)*ISNUMBER(D28)*ISNUMBER(C29)*ISNUMBER(D29)* ISNUMBER(C30)*ISNUMBER(D30)* ISNUMBER(C31)*ISNUMBER(D31)* ISNUMBER(C32)*ISNUMBER(D32),\" \", \"Cost should not be text or left blank!\"))","v":" "},null,null,10000,{"$f":"IF(I29<=12500,38.9*EXP(0.119*I29/1000),27.34*EXP(0.306*I29/1000))","v":127.86745896720328},{"$f":"IF(I29<25000,3.93*I29/1000+0.578,2/(10^14)*EXP(1.516*I29/1000))","v":39.878},{"$f":"IF(I29<=19000,69.37*EXP(0.093*I29/1000),0.48*EXP(0.438*I29/1000))","v":175.81890165135061},{"$f":"IF(I29<25000,5.675*I29/1000+3.713,2/(10^12)*EXP(1.32*I29/1000))","v":60.463000000000001}]
[null,15000,2692.8377206276123,59.528000000000006,null,null,null,null,15000,{"$f":"IF(I30<=12500,38.9*EXP(0.119*I30/1000),27.34*EXP(0.306*I30/1000))","v":2692.8377206276123},{"$f":"IF(I30<25000,3.93*I30/1000+0.578,2/(10^14)*EXP(1.516*I30/1000))","v":59.528000000000006},{"$f":"IF(I30<=19000,69.37*EXP(0.093*I30/1000),0.48*EXP(0.438*I30/1000))","v":279.90618610349594},{"$f":"IF(I30<25000,5.675*I30/1000+3.713,2/(10^12)*EXP(1.32*I30/1000))","v":88.837999999999994}]
[null,20000,12436.000747617014,79.177999999999997,null,null,null,null,20000,{"$f":"IF(I31<=12500,38.9*EXP(0.119*I31/1000),27.34*EXP(0.306*I31/1000))","v":12436.000747617014},{"$f":"IF(I31<25000,3.93*I31/1000+0.578,2/(10^14)*EXP(1.516*I31/1000))","v":79.177999999999997},{"$f":"IF(I31<=19000,69.37*EXP(0.093*I31/1000),0.48*EXP(0.438*I31/1000))","v":3059.5735574358669},{"$f":"IF(I31<25000,5.675*I31/1000+3.713,2/(10^12)*EXP(1.32*I31/1000))","v":117.21299999999999}]
[null,25000,57431.650414747659,576.48878080473003,null,null,null,null,25000,{"$f":"IF(I32<=12500,38.9*EXP(0.119*I32/1000),27.34*EXP(0.306*I32/1000))","v":57431.650414747659},{"$f":"IF(I32<25000,3.93*I32/1000+0.578,2/(10^14)*EXP(1.516*I32/1000))","v":576.48878080473003},{"$f":"IF(I32<=19000,69.37*EXP(0.093*I32/1000),0.48*EXP(0.438*I32/1000))","v":27337.94177578645},{"$f":"IF(I32<25000,5.675*I32/1000+3.713,2/(10^12)*EXP(1.32*I32/1000))","v":429.28715957183209}]
[null,{"$f":"B8","v":"No"},"","",null,{"$f":"IF(ISNUMBER(C33)*ISNUMBER(D33),\"\", IF(AND(C33=\"\", D33=\"\"),\"\",IF(AND(ISNUMBER(C33),D33=\"\"),\"\", IF(AND(ISNUMBER(D33),C33=\"\"),\"\",\"Cost for user ADT should not be text !\"))))","v":""},null,null,{"$f":"IF(B8=\"No\", \"No\",VALUE(B8))","v":"No"},{"$f":"IF(I33=\"No\",\"\",IF(I33<=12500,38.9*EXP(0.119*I33/1000),27.34*EXP(0.306*I33/1000)))","v":""},{"$f":"IF(I33=\"No\",\"\",IF(I33<25000,3.93*I33/1000+0.578,2/(10^14)*EXP(1.516*I33/1000)))","v":""},{"$f":"IF(I33=\"No\",\"\",IF(I33<=19000,69.37*EXP(0.093*I33/1000),0.48*EXP(0.438*I33/1000)))","v":""},{"$f":"IF(I33=\"No\",\"\",IF(I33<25000,5.675*I33/1000+3.713,2/(10^12)*EXP(1.32*I33/1000)))","v":""}]

{"sheet":"Restripe-PCC","index":1,"n_rows":35,"n_cols":48,"rows_kept":35,"cut":false,"hidden":true,"merged":[[7,41,7,46],[8,41,8,46],[9,41,9,46],[10,41,10,46],[27,43,27,45],[17,42,17,46],[11,41,11,46],[12,41,12,46],[13,41,13,46],[18,43,18,44],[18,45,18,46],[2,1,2,6],[0,1,0,13],[2,8,2,13],[2,15,2,20],[2,22,2,27],[0,15,0,27],[4,41,4,46],[5,41,5,46],[6,41,6,46],[0,29,0,38],[2,29,2,34],[2,35,2,38],[0,40,0,49],[3,41,3,47]]}
[null,"Restripe-PCC: Marking Benefit/Cost by ADT",null,null,null,null,null,null,null,null,null,null,null,null,null,"Restripe-PCC: Marking and User Delay Costs",null,null,null,null,null,null,null,null,null,null,null,null,null,"Restripe-PCC: User Benefit and Expected Service Life",null,null,null,null,null,null,null,null,null,null,"Restripe-PCC: Data Used in the Analysis"]
[]
[null,"Off-peak Application",null,null,null,null,null,null,"Nighttime Application",null,null,null,null,null,null,"Off-peak Application",null,null,null,null,null,null,"Night time Application",null,null,null,null,null,null,"User Benefit",null,null,null,null,null,"Expected Service Life"]
[null,null,null,null,null,null,null,null,null,null,null,null,null,null,null,null,null,null,null,null,null,null,null,null,null,null,null,null,null,null,null,null,null,null,null,null,null,null,null,null,null,"Variables"]
[null,null,null,null,null,null,null,null,null,null,null,null,null,null,null,null,null,null,null,null,null,null,null,null,null,null,null,null,null,null,null,null,null,null,null,null,null,null,null,null,null,{"$f":"Input!A4","v":"    Pavement Surface Type"},null,null,null,null,null,{"$f":"Input!B4","v":"PCC"}]
[null,null,null,null,null,null,null,null,null,null,null,null,null,null,null,null,null,null,null,null,null,null,null,null,null,null,null,null,null,null,null,null,null,null,null,null,null,null,null,null,null,{"$f":"Input!A5","v":"    Restripe/New Stripe"},null,null,null,null,null,{"$f":"Input!B5","v":"New Stripe"}]
[null,null,null,null,null,null,null,null,null,null,null,null,null,null,null,null,null,null,null,null,null,null,null,null,null,null,null,null,null,null,null,null,null,null,null,null,null,null,null,null,null,{"$f":"Input!A8","v":"Additional ADT Value for Analysis (To assign a different ADT, first click No, then Yes again)"},null,null,null,null,null,{"$f":"Input!B8","v":"No"}]
[null,null,null,null,null,null,null,null,null,null,null,null,null,null,null,null,null,null,null,null,null,null,null,null,null,null,null,null,null,null,null,null,null,null,null,null,null,null,null,null,null,{"$f":"Input!A10","v":"    Minimum Effective Retroreflectivity (white)"},null,null,null,null,null,{"$f":"Input!B10","v":100}]
[null,null,null,null,null,null,null,null,null,null,null,null,null,null,null,null,null,null,null,null,null,null,null,null,null,null,null,null,null,null,null,null,null,null,null,null,null,null,null,null,null,{"$f":"Input!A11","v":"    Minimum Effective Retroreflectivity (yellow)"},null,null,null,null,null,{"$f":"Input!B11","v":100}]
[null,null,null,null,null,null,null,null,null,null,null,null,null,null,null,null,null,null,null,null,null,null,null,null,null,null,null,null,null,null,null,null,null,null,null,null,null,null,null,null,null,{"$f":"Input!A12","v":"    Maximum Effective Retroreflectivity"},null,null,null,null,null,{"$f":"Input!B12","v":200}]
[null,null,null,null,null,null,null,null,null,null,null,null,null,null,null,null,null,null,null,null,null,null,null,null,null,null,null,null,null,null,null,null,null,null,null,null,null,null,null,null,null,{"$f":"Input!A13","v":"    Remaining Pavement Service Life (Month)"},null,null,null,null,null,{"$f":"Input!B13","v":100}]
[null,null,null,null,null,null,null,null,null,null,null,null,null,null,null,null,null,null,null,null,null,null,null,null,null,null,null,null,null,null,null,null,null,null,null,null,null,null,null,null,null,{"$f":"Input!A23","v":"    % Decrease for Off-Peak Application Cost"},null,null,null,null,null,{"$f":"Input!B23","v":15}]
[null,null,null,null,null,null,null,null,null,null,null,null,null,null,null,null,null,null,null,null,null,null,null,null,null,null,null,null,null,null,null,null,null,null,null,null,null,null,null,null,null,{"$f":"Input!A24","v":"    % Increase for Night Time Application Cost"},null,null,null,null,null,{"$f":"Input!B24","v":15}]
[null,null,null,null,null,null,null,null,null,null,null,null,null,null,null,null,null,null,null,null,null,null,null,null,null,null,null,null,null,null,null,null,null,null,null,null,null,null,null,null,null,{"$f":"Input!A26","v":"    Number of Lanes in One Direction"},null,null,null,null,null,{"$f":"Input!B26","v":"2"}]
[]
[]
[]
[null,null,null,null,null,null,null,null,null,null,null,null,null,null,null,null,null,null,null,null,null,null,null,null,null,null,null,null,null,null,null,null,null,null,null,null,null,null,null,null,null,null,"Application/Removal Costs ($/mile)"]
[null,null,null,null,null,null,null,null,null,null,null,null,null,null,null,null,null,null,null,null,null,null,null,null,null,null,null,null,null,null,null,null,null,null,null,null,null,null,null,null,null,null,null,"Average Application Costs",null,"Average Removal Costs"]
[null,null,null,null,null,null,null,null,null,null,null,null,null,null,null,null,null,null,null,null,null,null,null,null,null,null,null,null,null,null,null,null,null,null,null,null,null,null,null,null,null,null,{"$f":"Input!A18","v":"Material"},"Solid","Dash","Solid","Dash"]
[null,null,null,null,null,null,null,null,null,null,null,null,null,null,null,null,null,null,null,null,null,null,null,null,null,null,null,null,null,null,null,null,null,null,null,null,null,null,null,null,null,null,"40 Mil",{"$f":"Input!B19","v":1039},{"$f":"Input!C19","v":391},{"$f":"Input!D19","v":5250},{"$f":"Input!E19","v":5250}]
[null,null,null,null,null,null,null,null,null,null,null,null,null,null,null,null,null,null,null,null,null,null,null,null,null,null,null,null,null,null,null,null,null,null,null,null,null,null,null,null,null,null,"90 Mil",{"$f":"Input!B20","v":2458},{"$f":"Input!C20","v":817},{"$f":"Input!D20","v":5250},{"$f":"Input!E20","v":5250}]
[null,null,null,null,null,null,null,null,null,null,null,null,null,null,null,null,null,null,null,null,null,null,null,null,null,null,null,null,null,null,null,null,null,null,null,null,null,null,null,null,null,null,"Tape",{"$f":"Input!B21","v":8108},{"$f":"Input!C21","v":3861},{"$f":"Input!D21","v":5250},{"$f":"Input!E21","v":5250}]
[null,null,null,null,null,null,null,null,null,null,null,null,null,null,null,null,null,null,null,null,null,null,null,null,null,null,null,null,null,null,null,null,null,null,null,null,null,null,null,null,null,null,"Inverted",{"$f":"Input!B22","v":5270},{"$f":"Input!C22","v":2505},{"$f":"Input!D22","v":5250},{"$f":"Input!E22","v":5250}]
[]
[]
[]
[null,null,null,null,null,null,null,null,null,null,null,null,null,null,null,null,null,null,null,null,null,null,null,null,null,null,null,null,null,null,null,null,null,null,null,null,null,null,null,null,null,null,null,"User Costs ($/mile)"]
[null,null,null,null,null,null,null,null,null,null,null,null,null,null,null,null,null,null,null,null,null,null,null,null,null,null,null,null,null,null,null,null,null,null,null,null,null,null,null,null,null,null,null,"ADT/Lane","Off-Peak","Night Time"]
[null,null,null,null,null,null,null,null,null,null,null,null,null,null,null,null,null,null,null,null,null,null,null,null,null,null,null,null,null,null,null,null,null,null,null,null,null,null,null,null,null,null,null,{"$f":"Input!B28","v":5000},{"$f":"Input!C28","v":70.526903758950084},{"$f":"Input!D28","v":20.227999999999998}]
[null,null,null,null,null,null,null,null,null,null,null,null,null,null,null,null,null,null,null,null,null,null,null,null,null,null,null,null,null,null,null,null,null,null,null,null,null,null,null,null,null,null,null,{"$f":"Input!B29","v":10000},{"$f":"Input!C29","v":127.86745896720328},{"$f":"Input!D29","v":39.878}]
[null,null,null,null,null,null,null,null,null,null,null,null,null,null,null,null,null,null,null,null,null,null,null,null,null,null,null,null,null,null,null,null,null,null,null,null,null,null,null,null,null,null,null,{"$f":"Input!B30","v":15000},{"$f":"Input!C30","v":2692.8377206276123},{"$f":"Input!D30","v":59.528000000000006}]
[null,null,null,null,null,null,null,null,null,null,null,null,null,null,null,null,null,null,null,null,null,null,null,null,null,null,null,null,null,null,null,null,null,null,null,null,null,null,null,null,null,null,null,{"$f":"Input!B31","v":20000},{"$f":"Input!C31","v":12436.000747617014},{"$f":"Input!D31","v":79.177999999999997}]
[null,null,null,null,null,null,null,null,null,null,null,null,null,null,null,null,null,null,null,null,null,null,null,null,null,null,null,null,null,null,null,null,null,null,null,null,null,null,null,null,null,null,null,{"$f":"Input!B32","v":25000},{"$f":"Input!C32","v":57431.650414747659},{"$f":"Input!D32","v":576.48878080473003}]
[null,null,null,null,null,null,null,null,null,null,null,null,null,null,null,null,null,null,null,null,null,null,null,null,null,null,null,null,null,null,null,null,null,null,null,null,null,null,null,null,null,null,null,{"$f":"Input!B33","v":"No"},{"$f":"Input!C33","v":""},{"$f":"Input!D33","v":""}]

{"sheet":"Restripe-AC","index":2,"n_rows":35,"n_cols":48,"rows_kept":35,"cut":false,"hidden":true,"merged":[[27,43,27,45],[11,41,11,46],[12,41,12,46],[13,41,13,46],[17,42,17,46],[18,43,18,44],[18,45,18,46],[6,41,6,46],[7,41,7,46],[8,41,8,46],[9,41,9,46],[10,41,10,46],[3,41,3,47],[4,41,4,46],[5,41,5,46],[0,40,0,48],[0,29,0,38],[2,29,2,34],[2,35,2,38],[0,1,0,13],[0,15,0,27],[2,1,2,6],[2,8,2,13],[2,15,2,20],[2,22,2,27]]}
[null,"Restripe-AC: Marking Benefit/Cost by ADT",null,null,null,null,null,null,null,null,null,null,null,null,null,"Restripe-AC: Marking and User Delay Costs",null,null,null,null,null,null,null,null,null,null,null,null,null,"Restripe-AC: User Benefit and Expected Service Life",null,null,null,null,null,null,null,null,null,null,"Restripe-AC: Data Used in the Analysis"]
[]
[null,"Off-peak Application",null,null,null,null,null,null,"Nighttime Application",null,null,null,null,null,null,"Off-peak Application",null,null,null,null,null,null,"Night time Application",null,null,null,null,null,null,"User Benefit",null,null,null,null,null,"Expected Service Life"]
[null,null,null,null,null,null,null,null,null,null,null,null,null,null,null,null,null,null,null,null,null,null,null,null,null,null,null,null,null,null,null,null,null,null,null,null,null,null,null,null,null,"Variables"]
[null,null,null,null,null,null,null,null,null,null,null,null,null,null,null,null,null,null,null,null,null,null,null,null,null,null,null,null,null,null,null,null,null,null,null,null,null,null,null,null,null,{"$f":"Input!A4","v":"    Pavement Surface Type"},null,null,null,null,null,{"$f":"Input!B4","v":"PCC"}]
[null,null,null,null,null,null,null,null,null,null,null,null,null,null,null,null,null,null,null,null,null,null,null,null,null,null,null,null,null,null,null,null,null,null,null,null,null,null,null,null,null,{"$f":"Input!A5","v":"    Restripe/New Stripe"},null,null,null,null,null,{"$f":"Input!B5","v":"New Stripe"}]
[null,null,null,null,null,null,null,null,null,null,null,null,null,null,null,null,null,null,null,null,null,null,null,null,null,null,null,null,null,null,null,null,null,null,null,null,null,null,null,null,null,{"$f":"Input!A8","v":"Additional ADT Value for Analysis (To assign a different ADT, first click No, then Yes again)"},null,null,null,null,null,{"$f":"Input!B8","v":"No"}]
[null,null,null,null,null,null,null,null,null,null,null,null,null,null,null,null,null,null,null,null,null,null,null,null,null,null,null,null,null,null,null,null,null,null,null,null,null,null,null,null,null,{"$f":"Input!A10","v":"    Minimum Effective Retroreflectivity (white)"},null,null,null,null,null,{"$f":"Input!B10","v":100}]
[null,null,null,null,null,null,null,null,null,null,null,null,null,null,null,null,null,null,null,null,null,null,null,null,null,null,null,null,null,null,null,null,null,null,null,null,null,null,null,null,null,{"$f":"Input!A11","v":"    Minimum Effective Retroreflectivity (yellow)"},null,null,null,null,null,{"$f":"Input!B11","v":100}]
[null,null,null,null,null,null,null,null,null,null,null,null,null,null,null,null,null,null,null,null,null,null,null,null,null,null,null,null,null,null,null,null,null,null,null,null,null,null,null,null,null,{"$f":"Input!A12","v":"    Maximum Effective Retroreflectivity"},null,null,null,null,null,{"$f":"Input!B12","v":200}]
[null,null,null,null,null,null,null,null,null,null,null,null,null,null,null,null,null,null,null,null,null,null,null,null,null,null,null,null,null,null,null,null,null,null,null,null,null,null,null,null,null,{"$f":"Input!A13","v":"    Remaining Pavement Service Life (Month)"},null,null,null,null,null,{"$f":"Input!B13","v":100}]
[null,null,null,null,null,null,null,null,null,null,null,null,null,null,null,null,null,null,null,null,null,null,null,null,null,null,null,null,null,null,null,null,null,null,null,null,null,null,null,null,null,{"$f":"Input!A23","v":"    % Decrease for Off-Peak Application Cost"},null,null,null,null,null,{"$f":"Input!B23","v":15}]
[null,null,null,null,null,null,null,null,null,null,null,null,null,null,null,null,null,null,null,null,null,null,null,null,null,null,null,null,null,null,null,null,null,null,null,null,null,null,null,null,null,{"$f":"Input!A24","v":"    % Increase for Night Time Application Cost"},null,null,null,null,null,{"$f":"Input!B24","v":15}]
[null,null,null,null,null,null,null,null,null,null,null,null,null,null,null,null,null,null,null,null,null,null,null,null,null,null,null,null,null,null,null,null,null,null,null,null,null,null,null,null,null,{"$f":"Input!A26","v":"    Number of Lanes in One Direction"},null,null,null,null,null,{"$f":"Input!B26","v":"2"}]
[]
[]
[]
[null,null,null,null,null,null,null,null,null,null,null,null,null,null,null,null,null,null,null,null,null,null,null,null,null,null,null,null,null,null,null,null,null,null,null,null,null,null,null,null,null,null,"Application/Removal Costs ($/mile)"]
[null,null,null,null,null,null,null,null,null,null,null,null,null,null,null,null,null,null,null,null,null,null,null,null,null,null,null,null,null,null,null,null,null,null,null,null,null,null,null,null,null,null,null,"Average Application Costs",null,"Average Removal Costs"]
[null,null,null,null,null,null,null,null,null,null,null,null,null,null,null,null,null,null,null,null,null,null,null,null,null,null,null,null,null,null,null,null,null,null,null,null,null,null,null,null,null,null,{"$f":"Input!A18","v":"Material"},"Solid","Dash","Solid","Dash"]
[null,null,null,null,null,null,null,null,null,null,null,null,null,null,null,null,null,null,null,null,null,null,null,null,null,null,null,null,null,null,null,null,null,null,null,null,null,null,null,null,null,null,"40 Mil",{"$f":"Input!B19","v":1039},{"$f":"Input!C19","v":391},{"$f":"Input!D19","v":5250},{"$f":"Input!E19","v":5250}]
[null,null,null,null,null,null,null,null,null,null,null,null,null,null,null,null,null,null,null,null,null,null,null,null,null,null,null,null,null,null,null,null,null,null,null,null,null,null,null,null,null,null,"90 Mil",{"$f":"Input!B20","v":2458},{"$f":"Input!C20","v":817},{"$f":"Input!D20","v":5250},{"$f":"Input!E20","v":5250}]
[null,null,null,null,null,null,null,null,null,null,null,null,null,null,null,null,null,null,null,null,null,null,null,null,null,null,null,null,null,null,null,null,null,null,null,null,null,null,null,null,null,null,"Tape",{"$f":"Input!B21","v":8108},{"$f":"Input!C21","v":3861},{"$f":"Input!D21","v":5250},{"$f":"Input!E21","v":5250}]
[null,null,null,null,null,null,null,null,null,null,null,null,null,null,null,null,null,null,null,null,null,null,null,null,null,null,null,null,null,null,null,null,null,null,null,null,null,null,null,null,null,null,"Inverted",{"$f":"Input!B22","v":5270},{"$f":"Input!C22","v":2505},{"$f":"Input!D22","v":5250},{"$f":"Input!E22","v":5250}]
[]
[]
[]
[null,null,null,null,null,null,null,null,null,null,null,null,null,null,null,null,null,null,null,null,null,null,null,null,null,null,null,null,null,null,null,null,null,null,null,null,null,null,null,null,null,null,null,"User Costs ($/mile)"]
[null,null,null,null,null,null,null,null,null,null,null,null,null,null,null,null,null,null,null,null,null,null,null,null,null,null,null,null,null,null,null,null,null,null,null,null,null,null,null,null,null,null,null,"ADT/Lane","Off-Peak","Night Time"]
[null,null,null,null,null,null,null,null,null,null,null,null,null,null,null,null,null,null,null,null,null,null,null,null,null,null,null,null,null,null,null,null,null,null,null,null,null,null,null,null,null,null,null,{"$f":"Input!B28","v":5000},{"$f":"Input!C28","v":70.526903758950084},{"$f":"Input!D28","v":20.227999999999998}]
[null,null,null,null,null,null,null,null,null,null,null,null,null,null,null,null,null,null,null,null,null,null,null,null,null,null,null,null,null,null,null,null,null,null,null,null,null,null,null,null,null,null,null,{"$f":"Input!B29","v":10000},{"$f":"Input!C29","v":127.86745896720328},{"$f":"Input!D29","v":39.878}]
[null,null,null,null,null,null,null,null,null,null,null,null,null,null,null,null,null,null,null,null,null,null,null,null,null,null,null,null,null,null,null,null,null,null,null,null,null,null,null,null,null,null,null,{"$f":"Input!B30","v":15000},{"$f":"Input!C30","v":2692.8377206276123},{"$f":"Input!D30","v":59.528000000000006}]
[null,null,null,null,null,null,null,null,null,null,null,null,null,null,null,null,null,null,null,null,null,null,null,null,null,null,null,null,null,null,null,null,null,null,null,null,null,null,null,null,null,null,null,{"$f":"Input!B31","v":20000},{"$f":"Input!C31","v":12436.000747617014},{"$f":"Input!D31","v":79.177999999999997}]
[null,null,null,null,null,null,null,null,null,null,null,null,null,null,null,null,null,null,null,null,null,null,null,null,null,null,null,null,null,null,null,null,null,null,null,null,null,null,null,null,null,null,null,{"$f":"Input!B32","v":25000},{"$f":"Input!C32","v":57431.650414747659},{"$f":"Input!D32","v":576.48878080473003}]
[null,null,null,null,null,null,null,null,null,null,null,null,null,null,null,null,null,null,null,null,null,null,null,null,null,null,null,null,null,null,null,null,null,null,null,null,null,null,null,null,null,null,null,{"$f":"Input!B33","v":"No"},{"$f":"Input!C33","v":""},{"$f":"Input!D33","v":""}]

{"sheet":"New Stripe-PCC","index":3,"n_rows":35,"n_cols":48,"rows_kept":35,"cut":false,"hidden":true,"merged":[[27,43,27,45],[11,41,11,46],[12,41,12,46],[13,41,13,46],[17,42,17,46],[18,43,18,44],[18,45,18,46],[6,41,6,46],[7,41,7,46],[8,41,8,46],[9,41,9,46],[10,41,10,46],[0,40,0,49],[3,41,3,47],[4,41,4,46],[5,41,5,46],[0,29,0,38],[2,29,2,34],[2,35,2,38],[0,1,0,13],[0,15,0,27],[2,1,2,6],[2,8,2,13],[2,15,2,20],[2,22,2,27]]}
[null,"New Stripe-PCC: Marking Benefit/Cost by ADT",null,null,null,null,null,null,null,null,null,null,null,null,null,"New Stripe-PCC: Marking and User Delay Costs",null,null,null,null,null,null,null,null,null,null,null,null,null,"New Stripe-PCC: User Benefit and Expected Service Life",null,null,null,null,null,null,null,null,null,null,"New Stripe-PCC: Data Used in the Analysis"]
[]
[null,"Off-peak Application",null,null,null,null,null,null,"Nighttime Application",null,null,null,null,null,null,"Off-peak Application",null,null,null,null,null,null,"Night time Application",null,null,null,null,null,null,"User Benefit",null,null,null,null,null,"Expected Service Life"]
[null,null,null,null,null,null,null,null,null,null,null,null,null,null,null,null,null,null,null,null,null,null,null,null,null,null,null,null,null,null,null,null,null,null,null,null,null,null,null,null,null,"Variables"]
[null,null,null,null,null,null,null,null,null,null,null,null,null,null,null,null,null,null,null,null,null,null,null,null,null,null,null,null,null,null,null,null,null,null,null,null,null,null,null,null,null,{"$f":"Input!A4","v":"    Pavement Surface Type"},null,null,null,null,null,{"$f":"Input!B4","v":"PCC"}]
[null,null,null,null,null,null,null,null,null,null,null,null,null,null,null,null,null,null,null,null,null,null,null,null,null,null,null,null,null,null,null,null,null,null,null,null,null,null,null,null,null,{"$f":"Input!A5","v":"    Restripe/New Stripe"},null,null,null,null,null,{"$f":"Input!B5","v":"New Stripe"}]
[null,null,null,null,null,null,null,null,null,null,null,null,null,null,null,null,null,null,null,null,null,null,null,null,null,null,null,null,null,null,null,null,null,null,null,null,null,null,null,null,null,{"$f":"Input!A8","v":"Additional ADT Value for Analysis (To assign a different ADT, first click No, then Yes again)"},null,null,null,null,null,{"$f":"Input!B8","v":"No"}]
[null,null,null,null,null,null,null,null,null,null,null,null,null,null,null,null,null,null,null,null,null,null,null,null,null,null,null,null,null,null,null,null,null,null,null,null,null,null,null,null,null,{"$f":"Input!A10","v":"    Minimum Effective Retroreflectivity (white)"},null,null,null,null,null,{"$f":"Input!B10","v":100}]
[null,null,null,null,null,null,null,null,null,null,null,null,null,null,null,null,null,null,null,null,null,null,null,null,null,null,null,null,null,null,null,null,null,null,null,null,null,null,null,null,null,{"$f":"Input!A11","v":"    Minimum Effective Retroreflectivity (yellow)"},null,null,null,null,null,{"$f":"Input!B11","v":100}]
[null,null,null,null,null,null,null,null,null,null,null,null,null,null,null,null,null,null,null,null,null,null,null,null,null,null,null,null,null,null,null,null,null,null,null,null,null,null,null,null,null,{"$f":"Input!A12","v":"    Maximum Effective Retroreflectivity"},null,null,null,null,null,{"$f":"Input!B12","v":200}]
[null,null,null,null,null,null,null,null,null,null,null,null,null,null,null,null,null,null,null,null,null,null,null,null,null,null,null,null,null,null,null,null,null,null,null,null,null,null,null,null,null,{"$f":"Input!A13","v":"    Remaining Pavement Service Life (Month)"},null,null,null,null,null,{"$f":"Input!B13","v":100}]
[null,null,null,null,null,null,null,null,null,null,null,null,null,null,null,null,null,null,null,null,null,null,null,null,null,null,null,null,null,null,null,null,null,null,null,null,null,null,null,null,null,{"$f":"Input!A23","v":"    % Decrease for Off-Peak Application Cost"},null,null,null,null,null,{"$f":"Input!B23","v":15}]
[null,null,null,null,null,null,null,null,null,null,null,null,null,null,null,null,null,null,null,null,null,null,null,null,null,null,null,null,null,null,null,null,null,null,null,null,null,null,null,null,null,{"$f":"Input!A24","v":"    % Increase for Night Time Application Cost"},null,null,null,null,null,{"$f":"Input!B24","v":15}]
[null,null,null,null,null,null,null,null,null,null,null,null,null,null,null,null,null,null,null,null,null,null,null,null,null,null,null,null,null,null,null,null,null,null,null,null,null,null,null,null,null,{"$f":"Input!A26","v":"    Number of Lanes in One Direction"},null,null,null,null,null,{"$f":"Input!B26","v":"2"}]
[]
[]
[]
[null,null,null,null,null,null,null,null,null,null,null,null,null,null,null,null,null,null,null,null,null,null,null,null,null,null,null,null,null,null,null,null,null,null,null,null,null,null,null,null,null,null,"Application/Removal Costs ($/mile)"]
[null,null,null,null,null,null,null,null,null,null,null,null,null,null,null,null,null,null,null,null,null,null,null,null,null,null,null,null,null,null,null,null,null,null,null,null,null,null,null,null,null,null,null,"Average Application Costs",null,"Average Removal Costs"]
[null,null,null,null,null,null,null,null,null,null,null,null,null,null,null,null,null,null,null,null,null,null,null,null,null,null,null,null,null,null,null,null,null,null,null,null,null,null,null,null,null,null,{"$f":"Input!A18","v":"Material"},"Solid","Dash","Solid","Dash"]
[null,null,null,null,null,null,null,null,null,null,null,null,null,null,null,null,null,null,null,null,null,null,null,null,null,null,null,null,null,null,null,null,null,null,null,null,null,null,null,null,null,null,"40 Mil",{"$f":"Input!B19","v":1039},{"$f":"Input!C19","v":391},{"$f":"Input!D19","v":5250},{"$f":"Input!E19","v":5250}]
[null,null,null,null,null,null,null,null,null,null,null,null,null,null,null,null,null,null,null,null,null,null,null,null,null,null,null,null,null,null,null,null,null,null,null,null,null,null,null,null,null,null,"90 Mil",{"$f":"Input!B20","v":2458},{"$f":"Input!C20","v":817},{"$f":"Input!D20","v":5250},{"$f":"Input!E20","v":5250}]
[null,null,null,null,null,null,null,null,null,null,null,null,null,null,null,null,null,null,null,null,null,null,null,null,null,null,null,null,null,null,null,null,null,null,null,null,null,null,null,null,null,null,"Tape",{"$f":"Input!B21","v":8108},{"$f":"Input!C21","v":3861},{"$f":"Input!D21","v":5250},{"$f":"Input!E21","v":5250}]
[null,null,null,null,null,null,null,null,null,null,null,null,null,null,null,null,null,null,null,null,null,null,null,null,null,null,null,null,null,null,null,null,null,null,null,null,null,null,null,null,null,null,"Inverted",{"$f":"Input!B22","v":5270},{"$f":"Input!C22","v":2505},{"$f":"Input!D22","v":5250},{"$f":"Input!E22","v":5250}]
[null,null,null,null,null,null,null,null,null,null,null,null,null,null,null,null,null,null,null,null,null,null,null,null,null,null,null,null,null,null,null,null,null,null,null,null,null,null,null,null,null,null,"For new stripe, removal costs were not used in the analysis"]
[]
[]
[null,null,null,null,null,null,null,null,null,null,null,null,null,null,null,null,null,null,null,null,null,null,null,null,null,null,null,null,null,null,null,null,null,null,null,null,null,null,null,null,null,null,null,"User Costs ($/mile)"]
[null,null,null,null,null,null,null,null,null,null,null,null,null,null,null,null,null,null,null,null,null,null,null,null,null,null,null,null,null,null,null,null,null,null,null,null,null,null,null,null,null,null,null,"ADT/Lane","Off-Peak","Night Time"]
[null,null,null,null,null,null,null,null,null,null,null,null,null,null,null,null,null,null,null,null,null,null,null,null,null,null,null,null,null,null,null,null,null,null,null,null,null,null,null,null,null,null,null,{"$f":"Input!B28","v":5000},{"$f":"Input!C28","v":70.526903758950084},{"$f":"Input!D28","v":20.227999999999998}]
[null,null,null,null,null,null,null,null,null,null,null,null,null,null,null,null,null,null,null,null,null,null,null,null,null,null,null,null,null,null,null,null,null,null,null,null,null,null,null,null,null,null,null,{"$f":"Input!B29","v":10000},{"$f":"Input!C29","v":127.86745896720328},{"$f":"Input!D29","v":39.878}]
[null,null,null,null,null,null,null,null,null,null,null,null,null,null,null,null,null,null,null,null,null,null,null,null,null,null,null,null,null,null,null,null,null,null,null,null,null,null,null,null,null,null,null,{"$f":"Input!B30","v":15000},{"$f":"Input!C30","v":2692.8377206276123},{"$f":"Input!D30","v":59.528000000000006}]
[null,null,null,null,null,null,null,null,null,null,null,null,null,null,null,null,null,null,null,null,null,null,null,null,null,null,null,null,null,null,null,null,null,null,null,null,null,null,null,null,null,null,null,{"$f":"Input!B31","v":20000},{"$f":"Input!C31","v":12436.000747617014},{"$f":"Input!D31","v":79.177999999999997}]
[null,null,null,null,null,null,null,null,null,null,null,null,null,null,null,null,null,null,null,null,null,null,null,null,null,null,null,null,null,null,null,null,null,null,null,null,null,null,null,null,null,null,null,{"$f":"Input!B32","v":25000},{"$f":"Input!C32","v":57431.650414747659},{"$f":"Input!D32","v":576.48878080473003}]
[null,null,null,null,null,null,null,null,null,null,null,null,null,null,null,null,null,null,null,null,null,null,null,null,null,null,null,null,null,null,null,null,null,null,null,null,null,null,null,null,null,null,null,{"$f":"Input!B33","v":"No"},{"$f":"Input!C33","v":""},{"$f":"Input!D33","v":""}]

{"sheet":"New Stripe-AC","index":4,"n_rows":35,"n_cols":48,"rows_kept":35,"cut":false,"hidden":true,"merged":[[27,43,27,45],[11,41,11,46],[12,41,12,46],[13,41,13,46],[17,42,17,46],[18,43,18,44],[18,45,18,46],[6,41,6,46],[7,41,7,46],[8,41,8,46],[9,41,9,46],[10,41,10,46],[0,40,0,49],[3,41,3,47],[4,41,4,46],[5,41,5,46],[0,29,0,38],[2,29,2,34],[2,35,2,38],[0,1,0,13],[0,15,0,27],[2,1,2,6],[2,8,2,13],[2,15,2,20],[2,22,2,27]]}
[null,"New Stripe-AC: Marking Benefit/Cost by ADT",null,null,null,null,null,null,null,null,null,null,null,null,null,"New Stripe-AC: Marking and User Delay Costs",null,null,null,null,null,null,null,null,null,null,null,null,null,"New Stripe-AC: User Benefit and Expected Service Life",null,null,null,null,null,null,null,null,null,null,"New Stripe-AC: Data Used in the Analysis"]
[]
[null,"Off-peak Application",null,null,null,null,null,null,"Nighttime Application",null,null,null,null,null,null,"Off-peak Application",null,null,null,null,null,null,"Night time Application",null,null,null,null,null,null,"User Benefit",null,null,null,null,null,"Expected Service Life"]
[null,null,null,null,null,null,null,null,null,null,null,null,null,null,null,null,null,null,null,null,null,null,null,null,null,null,null,null,null,null,null,null,null,null,null,null,null,null,null,null,null,"Variables"]
[null,null,null,null,null,null,null,null,null,null,null,null,null,null,null,null,null,null,null,null,null,null,null,null,null,null,null,null,null,null,null,null,null,null,null,null,null,null,null,null,null,{"$f":"Input!A4","v":"    Pavement Surface Type"},null,null,null,null,null,{"$f":"Input!B4","v":"PCC"}]
[null,null,null,null,null,null,null,null,null,null,null,null,null,null,null,null,null,null,null,null,null,null,null,null,null,null,null,null,null,null,null,null,null,null,null,null,null,null,null,null,null,{"$f":"Input!A5","v":"    Restripe/New Stripe"},null,null,null,null,null,{"$f":"Input!B5","v":"New Stripe"}]
[null,null,null,null,null,null,null,null,null,null,null,null,null,null,null,null,null,null,null,null,null,null,null,null,null,null,null,null,null,null,null,null,null,null,null,null,null,null,null,null,null,{"$f":"Input!A8","v":"Additional ADT Value for Analysis (To assign a different ADT, first click No, then Yes again)"},null,null,null,null,null,{"$f":"Input!B8","v":"No"}]
[null,null,null,null,null,null,null,null,null,null,null,null,null,null,null,null,null,null,null,null,null,null,null,null,null,null,null,null,null,null,null,null,null,null,null,null,null,null,null,null,null,{"$f":"Input!A10","v":"    Minimum Effective Retroreflectivity (white)"},null,null,null,null,null,{"$f":"Input!B10","v":100}]
[null,null,null,null,null,null,null,null,null,null,null,null,null,null,null,null,null,null,null,null,null,null,null,null,null,null,null,null,null,null,null,null,null,null,null,null,null,null,null,null,null,{"$f":"Input!A11","v":"    Minimum Effective Retroreflectivity (yellow)"},null,null,null,null,null,{"$f":"Input!B11","v":100}]
[null,null,null,null,null,null,null,null,null,null,null,null,null,null,null,null,null,null,null,null,null,null,null,null,null,null,null,null,null,null,null,null,null,null,null,null,null,null,null,null,null,{"$f":"Input!A12","v":"    Maximum Effective Retroreflectivity"},null,null,null,null,null,{"$f":"Input!B12","v":200}]
[null,null,null,null,null,null,null,null,null,null,null,null,null,null,null,null,null,null,null,null,null,null,null,null,null,null,null,null,null,null,null,null,null,null,null,null,null,null,null,null,null,{"$f":"Input!A13","v":"    Remaining Pavement Service Life (Month)"},null,null,null,null,null,{"$f":"Input!B13","v":100}]
[null,null,null,null,null,null,null,null,null,null,null,null,null,null,null,null,null,null,null,null,null,null,null,null,null,null,null,null,null,null,null,null,null,null,null,null,null,null,null,null,null,{"$f":"Input!A23","v":"    % Decrease for Off-Peak Application Cost"},null,null,null,null,null,{"$f":"Input!B23","v":15}]
[null,null,null,null,null,null,null,null,null,null,null,null,null,null,null,null,null,null,null,null,null,null,null,null,null,null,null,null,null,null,null,null,null,null,null,null,null,null,null,null,null,{"$f":"Input!A24","v":"    % Increase for Night Time Application Cost"},null,null,null,null,null,{"$f":"Input!B24","v":15}]
[null,null,null,null,null,null,null,null,null,null,null,null,null,null,null,null,null,null,null,null,null,null,null,null,null,null,null,null,null,null,null,null,null,null,null,null,null,null,null,null,null,{"$f":"Input!A26","v":"    Number of Lanes in One Direction"},null,null,null,null,null,{"$f":"Input!B26","v":"2"}]
[]
[]
[]
[null,null,null,null,null,null,null,null,null,null,null,null,null,null,null,null,null,null,null,null,null,null,null,null,null,null,null,null,null,null,null,null,null,null,null,null,null,null,null,null,null,null,"Application/Removal Costs ($/mile)"]
[null,null,null,null,null,null,null,null,null,null,null,null,null,null,null,null,null,null,null,null,null,null,null,null,null,null,null,null,null,null,null,null,null,null,null,null,null,null,null,null,null,null,null,"Average Application Costs",null,"Average Removal Costs"]
[null,null,null,null,null,null,null,null,null,null,null,null,null,null,null,null,null,null,null,null,null,null,null,null,null,null,null,null,null,null,null,null,null,null,null,null,null,null,null,null,null,null,{"$f":"Input!A18","v":"Material"},"Solid","Dash","Solid","Dash"]
[null,null,null,null,null,null,null,null,null,null,null,null,null,null,null,null,null,null,null,null,null,null,null,null,null,null,null,null,null,null,null,null,null,null,null,null,null,null,null,null,null,null,"40 Mil",{"$f":"Input!B19","v":1039},{"$f":"Input!C19","v":391},{"$f":"Input!D19","v":5250},{"$f":"Input!E19","v":5250}]
[null,null,null,null,null,null,null,null,null,null,null,null,null,null,null,null,null,null,null,null,null,null,null,null,null,null,null,null,null,null,null,null,null,null,null,null,null,null,null,null,null,null,"90 Mil",{"$f":"Input!B20","v":2458},{"$f":"Input!C20","v":817},{"$f":"Input!D20","v":5250},{"$f":"Input!E20","v":5250}]
[null,null,null,null,null,null,null,null,null,null,null,null,null,null,null,null,null,null,null,null,null,null,null,null,null,null,null,null,null,null,null,null,null,null,null,null,null,null,null,null,null,null,"Tape",{"$f":"Input!B21","v":8108},{"$f":"Input!C21","v":3861},{"$f":"Input!D21","v":5250},{"$f":"Input!E21","v":5250}]
[null,null,null,null,null,null,null,null,null,null,null,null,null,null,null,null,null,null,null,null,null,null,null,null,null,null,null,null,null,null,null,null,null,null,null,null,null,null,null,null,null,null,"Inverted",{"$f":"Input!B22","v":5270},{"$f":"Input!C22","v":2505},{"$f":"Input!D22","v":5250},{"$f":"Input!E22","v":5250}]
[null,null,null,null,null,null,null,null,null,null,null,null,null,null,null,null,null,null,null,null,null,null,null,null,null,null,null,null,null,null,null,null,null,null,null,null,null,null,null,null,null,null,"for new stripe, removal costs were not used in the alanlysis"]
[]
[]
[null,null,null,null,null,null,null,null,null,null,null,null,null,null,null,null,null,null,null,null,null,null,null,null,null,null,null,null,null,null,null,null,null,null,null,null,null,null,null,null,null,null,null,"User Costs ($/mile)"]
[null,null,null,null,null,null,null,null,null,null,null,null,null,null,null,null,null,null,null,null,null,null,null,null,null,null,null,null,null,null,null,null,null,null,null,null,null,null,null,null,null,null,null,"ADT/Lane","Off-Peak","Night Time"]
[null,null,null,null,null,null,null,null,null,null,null,null,null,null,null,null,null,null,null,null,null,null,null,null,null,null,null,null,null,null,null,null,null,null,null,null,null,null,null,null,null,null,null,{"$f":"Input!B28","v":5000},{"$f":"Input!C28","v":70.526903758950084},{"$f":"Input!D28","v":20.227999999999998}]
[null,null,null,null,null,null,null,null,null,null,null,null,null,null,null,null,null,null,null,null,null,null,null,null,null,null,null,null,null,null,null,null,null,null,null,null,null,null,null,null,null,null,null,{"$f":"Input!B29","v":10000},{"$f":"Input!C29","v":127.86745896720328},{"$f":"Input!D29","v":39.878}]
[null,null,null,null,null,null,null,null,null,null,null,null,null,null,null,null,null,null,null,null,null,null,null,null,null,null,null,null,null,null,null,null,null,null,null,null,null,null,null,null,null,null,null,{"$f":"Input!B30","v":15000},{"$f":"Input!C30","v":2692.8377206276123},{"$f":"Input!D30","v":59.528000000000006}]
[null,null,null,null,null,null,null,null,null,null,null,null,null,null,null,null,null,null,null,null,null,null,null,null,null,null,null,null,null,null,null,null,null,null,null,null,null,null,null,null,null,null,null,{"$f":"Input!B31","v":20000},{"$f":"Input!C31","v":12436.000747617014},{"$f":"Input!D31","v":79.177999999999997}]
[null,null,null,null,null,null,null,null,null,null,null,null,null,null,null,null,null,null,null,null,null,null,null,null,null,null,null,null,null,null,null,null,null,null,null,null,null,null,null,null,null,null,null,{"$f":"Input!B32","v":25000},{"$f":"Input!C32","v":57431.650414747659},{"$f":"Input!D32","v":576.48878080473003}]
[null,null,null,null,null,null,null,null,null,null,null,null,null,null,null,null,null,null,null,null,null,null,null,null,null,null,null,null,null,null,null,null,null,null,null,null,null,null,null,null,null,null,null,{"$f":"Input!B33","v":"No"},{"$f":"Input!C33","v":""},{"$f":"Input!D33","v":""}]

{"sheet":"Results","index":5,"n_rows":191,"n_cols":40,"rows_kept":191,"cut":false,"hidden":true,"merged":[[162,4,162,9],[161,0,163,0],[161,1,163,1],[161,2,163,2],[118,0,123,0],[118,1,120,1],[121,1,123,1],[164,0,169,0],[47,2,49,2],[47,3,49,3],[47,4,47,8],[100,0,105,0],[100,1,102,1],[103,1,105,1],[97,0,99,0],[97,1,99,1],[68,0,73,0],[68,1,70,1],[71,1,73,1],[62,0,67,0],[62,1,64,1],[65,1,67,1],[56,0,61,0],[56,1,58,1],[59,1,61,1],[0,18,0,30],[1,25,1,30],[1,18,1,23],[23,1,25,1],[26,1,28,1],[1,4,1,16],[23,0,28,0],[47,0,49,0],[47,1,49,1],[50,0,55,0],[50,1,52,1],[53,1,55,1],[1,39,1,44],[1,32,1,37],[0,32,0,44],[42,32,42,44],[43,32,43,37],[43,39,43,44],[11,0,16,0],[2,0,4,0],[2,11,2,15],[3,4,3,8],[3,11,3,15],[5,0,10,0],[5,1,7,1],[8,1,10,1],[11,1,13,1],[14,1,16,1],[2,1,4,1],[2,2,4,2],[2,3,4,3],[2,4,2,8],[2,10,4,10],[17,0,22,0],[17,1,19,1],[20,1,22,1],[98,18,98,23],[97,4,97,11],[48,11,48,15],[46,4,46,16],[98,12,98,17],[98,4,98,5],[97,12,97,23],[42,18,42,30],[43,18,43,23],[43,25,43,30],[47,10,49,10],[47,11,47,15],[48,4,48,8],[190,0,190,4],[190,5,190,9],[190,11,190,16],[190,18,190,23],[97,2,99,2],[164,1,166,1],[167,1,169,1],[182,0,187,0],[182,1,184,1],[185,1,187,1],[170,0,175,0],[170,1,172,1],[173,1,175,1],[176,0,181,0],[176,1,178,1],[179,1,181,1],[106,0,111,0],[106,1,108,1],[109,1,111,1],[112,0,117,0],[112,1,114,1],[115,1,117,1]]}
[null,null,null,null,null,null,null,null,null,null,null,null,null,null,null,null,null,null,"Restripe-PCC",null,null,null,null,null,null,null,null,null,null,null,null,null,"Restripe-AC"]
[null,null,null,null,"Restriping Benefit/Cost",null,null,null,null,null,null,null,null,null,null,null,null,null,"off-peak application",null,null,null,null,null,null,"night time application",null,null,null,null,null,null,"off-peak application",null,null,null,null,null,null,"night time application"]
["Marking Type","Pavement Type","Line Type",null,"Off-Peak Application",null,null,null,null,null,null,"Night Time Application"]
[null,null,null,null,"ADT Per Lane",null,null,null,null,"User Specified",null,"ADT Per Lane",null,null,null,null,"User Specified"]
[null,null,null,null,5000,10000,15000,20000,25000,{"$f":"IF(Input!$B$33=\"No\",\"\",Input!$B$33)","v":""},null,5000,10000,15000,20000,25000,{"$f":"IF(Input!$B$33=\"No\",\"\",Input!$B$33)","v":""}]
["Thermo (40 mil)","PCC","Yellow Edge","40 mil",{"$f":"MAX(0,'thermoplastic (40 mil)'!BN15)","v":461.58019658939554},{"$f":"MAX(0,'thermoplastic (40 mil)'!BO15)","v":908.01793319823605},{"$f":"MAX(0,'thermoplastic (40 mil)'!BP15)","v":906.82401245151482},{"$f":"MAX(0,'thermoplastic (40 mil)'!BQ15)","v":530.60459852863767},{"$f":"MAX(0,'thermoplastic (40 mil)'!BR15)","v":181.73652372690941},{"$f":"MAX(0,'thermoplastic (40 mil)'!BS15)","v":0},"40 mil",{"$f":"MAX(0,'thermoplastic (40 mil)'!BT15)","v":344.70501385852037},{"$f":"MAX(0,'thermoplastic (40 mil)'!BU15)","v":683.42906883775663},{"$f":"MAX(0,'thermoplastic (40 mil)'!BV15)","v":999.67301823505056},{"$f":"MAX(0,'thermoplastic (40 mil)'!BW15)","v":1290.4314469035444},{"$f":"MAX(0,'thermoplastic (40 mil)'!BX15)","v":1461.0275185064554},{"$f":"MAX(0,'thermoplastic (40 mil)'!BY15)","v":0}]
[null,null,"White Edge","40 mil",{"$f":"MAX(0,'thermoplastic (40 mil)'!BN16)","v":461.58019658939554},{"$f":"MAX(0,'thermoplastic (40 mil)'!BO16)","v":913.48936720911615},{"$f":"MAX(0,'thermoplastic (40 mil)'!BP16)","v":933.01131514503709},{"$f":"MAX(0,'thermoplastic (40 mil)'!BQ16)","v":562.37748350445679},{"$f":"MAX(0,'thermoplastic (40 mil)'!BR16)","v":199.11655833265962},{"$f":"MAX(0,'thermoplastic (40 mil)'!BS16)","v":0},"40 mil",{"$f":"MAX(0,'thermoplastic (40 mil)'!BT16)","v":344.70501385852037},{"$f":"MAX(0,'thermoplastic (40 mil)'!BU16)","v":687.54720011528798},{"$f":"MAX(0,'thermoplastic (40 mil)'!BV16)","v":1028.5416184966343},{"$f":"MAX(0,'thermoplastic (40 mil)'!BW16)","v":1367.703166834621},{"$f":"MAX(0,'thermoplastic (40 mil)'!BX16)","v":1600.7501692475498},{"$f":"MAX(0,'thermoplastic (40 mil)'!BY16)","v":0}]
[null,null,"White Lane","40 mil",{"$f":"MAX(0,'thermoplastic (40 mil)'!BN17)","v":513.83480652208482},{"$f":"MAX(0,'thermoplastic (40 mil)'!BO17)","v":1015.6991624396438},{"$f":"MAX(0,'thermoplastic (40 mil)'!BP17)","v":1001.6443366539538},{"$f":"MAX(0,'thermoplastic (40 mil)'!BQ17)","v":580.35439726520622},{"$f":"MAX(0,'thermoplastic (40 mil)'!BR17)","v":200.87904536951118},{"$f":"MAX(0,'thermoplastic (40 mil)'!BS17)","v":0},"40 mil",{"$f":"MAX(0,'thermoplastic (40 mil)'!BT17)","v":384.17931154452691},{"$f":"MAX(0,'thermoplastic (40 mil)'!BU17)","v":766.0454344611361},{"$f":"MAX(0,'thermoplastic (40 mil)'!BV17)","v":1145.6191980115718},{"$f":"MAX(0,'thermoplastic (40 mil)'!BW17)","v":1522.9211821279719},{"$f":"MAX(0,'thermoplastic (40 mil)'!BX17)","v":1769.6261640626999},{"$f":"MAX(0,'thermoplastic (40 mil)'!BY17)","v":0}]
[null,"AC","Yellow Edge","40 mil",{"$f":"MAX(0,'thermoplastic (40 mil)'!BN18)","v":461.58019658939554},{"$f":"MAX(0,'thermoplastic (40 mil)'!BO18)","v":809.6482262089819},{"$f":"MAX(0,'thermoplastic (40 mil)'!BP18)","v":520.22411753316658},{"$f":"MAX(0,'thermoplastic (40 mil)'!BQ18)","v":160.90774938592816},{"$f":"MAX(0,'thermoplastic (40 mil)'!BR18)","v":12.340242790770578},{"$f":"MAX(0,'thermoplastic (40 mil)'!BS18)","v":0},"40 mil",{"$f":"MAX(0,'thermoplastic (40 mil)'!BT18)","v":344.70501385852037},{"$f":"MAX(0,'thermoplastic (40 mil)'!BU18)","v":609.39009362422223},{"$f":"MAX(0,'thermoplastic (40 mil)'!BV18)","v":573.48946057033538},{"$f":"MAX(0,'thermoplastic (40 mil)'!BW18)","v":391.3279689506299},{"$f":"MAX(0,'thermoplastic (40 mil)'!BX18)","v":99.206444211836356},{"$f":"MAX(0,'thermoplastic (40 mil)'!BY18)","v":0}]
[null,null,"White Edge","40 mil",{"$f":"MAX(0,'thermoplastic (40 mil)'!BN19)","v":461.58019658939554},{"$f":"MAX(0,'thermoplastic (40 mil)'!BO19)","v":913.48936720911615},{"$f":"MAX(0,'thermoplastic (40 mil)'!BP19)","v":933.01131514503709},{"$f":"MAX(0,'thermoplastic (40 mil)'!BQ19)","v":543.85459139520367},{"$f":"MAX(0,'thermoplastic (40 mil)'!BR19)","v":126.20715499461512},{"$f":"MAX(0,'thermoplastic (40 mil)'!BS19)","v":0},"40 mil",{"$f":"MAX(0,'thermoplastic (40 mil)'!BT19)","v":344.70501385852037},{"$f":"MAX(0,'thermoplastic (40 mil)'!BU19)","v":687.54720011528798},{"$f":"MAX(0,'thermoplastic (40 mil)'!BV19)","v":1028.5416184966343},{"$f":"MAX(0,'thermoplastic (40 mil)'!BW19)","v":1322.6554561067771},{"$f":"MAX(0,'thermoplastic (40 mil)'!BX19)","v":1014.61237784334},{"$f":"MAX(0,'thermoplastic (40 mil)'!BY19)","v":0}]
[null,null,"White Lane","40 mil",{"$f":"MAX(0,'thermoplastic (40 mil)'!BN20)","v":513.83480652208482},{"$f":"MAX(0,'thermoplastic (40 mil)'!BO20)","v":1015.6991624396438},{"$f":"MAX(0,'thermoplastic (40 mil)'!BP20)","v":1001.6443366539538},{"$f":"MAX(0,'thermoplastic (40 mil)'!BQ20)","v":561.23940386489028},{"$f":"MAX(0,'thermoplastic (40 mil)'!BR20)","v":127.32428195029652},{"$f":"MAX(0,'thermoplastic (40 mil)'!BS20)","v":0},"40 mil",{"$f":"MAX(0,'thermoplastic (40 mil)'!BT20)","v":384.17931154452691},{"$f":"MAX(0,'thermoplastic (40 mil)'!BU20)","v":766.0454344611361},{"$f":"MAX(0,'thermoplastic (40 mil)'!BV20)","v":1145.6191980115718},{"$f":"MAX(0,'thermoplastic (40 mil)'!BW20)","v":1472.7610929087721},{"$f":"MAX(0,'thermoplastic (40 mil)'!BX20)","v":1121.6519883658248},{"$f":"MAX(0,'thermoplastic (40 mil)'!BY20)","v":0}]
["Thermo (90 mil)","PCC","Yellow Edge","90 mil",{"$f":"MAX(0,'thermoplastic (90 mil)'!BN15)","v":377.5108109780802},{"$f":"MAX(0,'thermoplastic (90 mil)'!BO15)","v":748.54025753747476},{"$f":"MAX(0,'thermoplastic (90 mil)'!BP15)","v":811.28111524210499},{"$f":"MAX(0,'thermoplastic (90 mil)'!BQ15)","v":526.65393601494418},{"$f":"MAX(0,'thermoplastic (90 mil)'!BR15)","v":195.36301838949987},{"$f":"MAX(0,'thermoplastic (90 mil)'!BS15)","v":0},"90 mil",{"$f":"MAX(0,'thermoplastic (90 mil)'!BT15)","v":281.39121618184083},{"$f":"MAX(0,'thermoplastic (90 mil)'!BU15)","v":561.54045371120969},{"$f":"MAX(0,'thermoplastic (90 mil)'!BV15)","v":840.45591707860217},{"$f":"MAX(0,'thermoplastic (90 mil)'!BW15)","v":1118.1457386683198},{"$f":"MAX(0,'thermoplastic (90 mil)'!BX15)","v":1324.0559338652931},{"$f":"MAX(0,'thermoplastic (90 mil)'!BY15)","v":0}]
[null,null,"White Edge","90 mil",{"$f":"MAX(0,'thermoplastic (90 mil)'!BN16)","v":377.5108109780802},{"$f":"MAX(0,'thermoplastic (90 mil)'!BO16)","v":748.54025753747476},{"$f":"MAX(0,'thermoplastic (90 mil)'!BP16)","v":811.28111524210499},{"$f":"MAX(0,'thermoplastic (90 mil)'!BQ16)","v":526.65393601494418},{"$f":"MAX(0,'thermoplastic (90 mil)'!BR16)","v":195.36301838949987},{"$f":"MAX(0,'thermoplastic (90 mil)'!BS16)","v":0},"90 mil",{"$f":"MAX(0,'thermoplastic (90 mil)'!BT16)","v":281.39121618184083},{"$f":"MAX(0,'thermoplastic (90 mil)'!BU16)","v":561.54045371120969},{"$f":"MAX(0,'thermoplastic (90 mil)'!BV16)","v":840.45591707860217},{"$f":"MAX(0,'thermoplastic (90 mil)'!BW16)","v":1118.1457386683198},{"$f":"MAX(0,'thermoplastic (90 mil)'!BX16)","v":1324.0559338652931},{"$f":"MAX(0,'thermoplastic (90 mil)'!BY16)","v":0}]
[null,null,"White Lane","90 mil",{"$f":"MAX(0,'thermoplastic (90 mil)'!BN17)","v":478.24218949725275},{"$f":"MAX(0,'thermoplastic (90 mil)'!BO17)","v":946.10647176016846},{"$f":"MAX(0,'thermoplastic (90 mil)'!BP17)","v":955.43984970339488},{"$f":"MAX(0,'thermoplastic (90 mil)'!BQ17)","v":568.40948078903205},{"$f":"MAX(0,'thermoplastic (90 mil)'!BR17)","v":199.71688002556203},{"$f":"MAX(0,'thermoplastic (90 mil)'!BS17)","v":0},"90 mil",{"$f":"MAX(0,'thermoplastic (90 mil)'!BT17)","v":357.28178871841311},{"$f":"MAX(0,'thermoplastic (90 mil)'!BU17)","v":712.56253448802681},{"$f":"MAX(0,'thermoplastic (90 mil)'!BV17)","v":1065.859001349804},{"$f":"MAX(0,'thermoplastic (90 mil)'!BW17)","v":1417.1877666084488},{"$f":"MAX(0,'thermoplastic (90 mil)'!BX17)","v":1654.8534882438628},{"$f":"MAX(0,'thermoplastic (90 mil)'!BY17)","v":0}]
[null,"AC","Yellow Edge","90 mil",{"$f":"MAX(0,'thermoplastic (90 mil)'!BN18)","v":377.5108109780802},{"$f":"MAX(0,'thermoplastic (90 mil)'!BO18)","v":748.54025753747476},{"$f":"MAX(0,'thermoplastic (90 mil)'!BP18)","v":811.28111524210499},{"$f":"MAX(0,'thermoplastic (90 mil)'!BQ18)","v":526.65393601494418},{"$f":"MAX(0,'thermoplastic (90 mil)'!BR18)","v":195.36301838949987},{"$f":"MAX(0,'thermoplastic (90 mil)'!BS18)","v":0},"90 mil",{"$f":"MAX(0,'thermoplastic (90 mil)'!BT18)","v":281.39121618184083},{"$f":"MAX(0,'thermoplastic (90 mil)'!BU18)","v":561.54045371120969},{"$f":"MAX(0,'thermoplastic (90 mil)'!BV18)","v":840.45591707860217},{"$f":"MAX(0,'thermoplastic (90 mil)'!BW18)","v":1118.1457386683198},{"$f":"MAX(0,'thermoplastic (90 mil)'!BX18)","v":1324.0559338652931},{"$f":"MAX(0,'thermoplastic (90 mil)'!BY18)","v":0}]
[null,null,"White Edge","90 mil",{"$f":"MAX(0,'thermoplastic (90 mil)'!BN19)","v":377.5108109780802},{"$f":"MAX(0,'thermoplastic (90 mil)'!BO19)","v":748.54025753747476},{"$f":"MAX(0,'thermoplastic (90 mil)'!BP19)","v":811.28111524210499},{"$f":"MAX(0,'thermoplastic (90 mil)'!BQ19)","v":526.65393601494418},{"$f":"MAX(0,'thermoplastic (90 mil)'!BR19)","v":195.36301838949987},{"$f":"MAX(0,'thermoplastic (90 mil)'!BS19)","v":0},"90 mil",{"$f":"MAX(0,'thermoplastic (90 mil)'!BT19)","v":281.39121618184083},{"$f":"MAX(0,'thermoplastic (90 mil)'!BU19)","v":561.54045371120969},{"$f":"MAX(0,'thermoplastic (90 mil)'!BV19)","v":840.45591707860217},{"$f":"MAX(0,'thermoplastic (90 mil)'!BW19)","v":1118.1457386683198},{"$f":"MAX(0,'thermoplastic (90 mil)'!BX19)","v":1324.0559338652931},{"$f":"MAX(0,'thermoplastic (90 mil)'!BY19)","v":0}]
[null,null,"White Lane","90 mil",{"$f":"MAX(0,'thermoplastic (90 mil)'!BN20)","v":478.24218949725275},{"$f":"MAX(0,'thermoplastic (90 mil)'!BO20)","v":946.10647176016846},{"$f":"MAX(0,'thermoplastic (90 mil)'!BP20)","v":955.43984970339488},{"$f":"MAX(0,'thermoplastic (90 mil)'!BQ20)","v":568.40948078903205},{"$f":"MAX(0,'thermoplastic (90 mil)'!BR20)","v":199.71688002556203},{"$f":"MAX(0,'thermoplastic (90 mil)'!BS20)","v":0},"90 mil",{"$f":"MAX(0,'thermoplastic (90 mil)'!BT20)","v":357.28178871841311},{"$f":"MAX(0,'thermoplastic (90 mil)'!BU20)","v":712.56253448802681},{"$f":"MAX(0,'thermoplastic (90 mil)'!BV20)","v":1065.859001349804},{"$f":"MAX(0,'thermoplastic (90 mil)'!BW20)","v":1417.1877666084488},{"$f":"MAX(0,'thermoplastic (90 mil)'!BX20)","v":1654.8534882438628},{"$f":"MAX(0,'thermoplastic (90 mil)'!BY20)","v":0}]
["Tape","PCC","Yellow Edge","tape",{"$f":"MAX(0,tape!BN15)","v":218.82169603615264},{"$f":"MAX(0,tape!BO15)","v":435.45785391722018},{"$f":"MAX(0,tape!BP15)","v":533.91659917924596},{"$f":"MAX(0,tape!BQ15)","v":420.33936880775514},{"$f":"MAX(0,tape!BR15)","v":181.72315603158413},{"$f":"MAX(0,tape!BS15)","v":0},"tape",{"$f":"MAX(0,tape!BT15)","v":162.52839045924546},{"$f":"MAX(0,tape!BU15)","v":324.64205940456236},{"$f":"MAX(0,tape!BV15)","v":486.34259217229658},{"$f":"MAX(0,tape!BW15)","v":647.63156602882304},{"$f":"MAX(0,tape!BX15)","v":784.27983078318562},{"$f":"MAX(0,tape!BY15)","v":0}]
[null,null,"White Edge","tape",{"$f":"MAX(0,tape!BN16)","v":218.82169603615264},{"$f":"MAX(0,tape!BO16)","v":435.45785391722018},{"$f":"MAX(0,tape!BP16)","v":533.91659917924596},{"$f":"MAX(0,tape!BQ16)","v":420.33936880775514},{"$f":"MAX(0,tape!BR16)","v":181.72315603158413},{"$f":"MAX(0,tape!BS16)","v":0},"tape",{"$f":"MAX(0,tape!BT16)","v":162.52839045924546},{"$f":"MAX(0,tape!BU16)","v":324.64205940456236},{"$f":"MAX(0,tape!BV16)","v":486.34259217229658},{"$f":"MAX(0,tape!BW16)","v":647.63156602882304},{"$f":"MAX(0,tape!BX16)","v":784.27983078318562},{"$f":"MAX(0,tape!BY16)","v":0}]
[null,null,"White Lane","tape",{"$f":"MAX(0,tape!BN17)","v":319.9026716335739},{"$f":"MAX(0,tape!BO17)","v":635.14505614990674},{"$f":"MAX(0,tape!BP17)","v":718.58437356428124},{"$f":"MAX(0,tape!BQ17)","v":495.53152594143319},{"$f":"MAX(0,tape!BR17)","v":191.78838714336896},{"$f":"MAX(0,tape!BS17)","v":0},"tape",{"$f":"MAX(0,tape!BT17)","v":238.14336573543721},{"$f":"MAX(0,tape!BU17)","v":475.39688033157609},{"$f":"MAX(0,tape!BV17)","v":711.76552204015161},{"$f":"MAX(0,tape!BW17)","v":947.25423204773267},{"$f":"MAX(0,tape!BX17)","v":1130.7981786610078},{"$f":"MAX(0,tape!BY17)","v":0}]
[null,"AC","Yellow Edge","tape",{"$f":"MAX(0,tape!BN18)","v":218.82169603615264},{"$f":"MAX(0,tape!BO18)","v":435.45785391722018},{"$f":"MAX(0,tape!BP18)","v":533.91659917924596},{"$f":"MAX(0,tape!BQ18)","v":420.33936880775514},{"$f":"MAX(0,tape!BR18)","v":181.72315603158413},{"$f":"MAX(0,tape!BS18)","v":0},"tape",{"$f":"MAX(0,tape!BT18)","v":162.52839045924546},{"$f":"MAX(0,tape!BU18)","v":324.64205940456236},{"$f":"MAX(0,tape!BV18)","v":486.34259217229658},{"$f":"MAX(0,tape!BW18)","v":647.63156602882304},{"$f":"MAX(0,tape!BX18)","v":784.27983078318562},{"$f":"MAX(0,tape!BY18)","v":0}]
[null,null,"White Edge","tape",{"$f":"MAX(0,tape!BN19)","v":218.82169603615264},{"$f":"MAX(0,tape!BO19)","v":435.45785391722018},{"$f":"MAX(0,tape!BP19)","v":533.91659917924596},{"$f":"MAX(0,tape!BQ19)","v":420.33936880775514},{"$f":"MAX(0,tape!BR19)","v":181.72315603158413},{"$f":"MAX(0,tape!BS19)","v":0},"tape",{"$f":"MAX(0,tape!BT19)","v":162.52839045924546},{"$f":"MAX(0,tape!BU19)","v":324.64205940456236},{"$f":"MAX(0,tape!BV19)","v":486.34259217229658},{"$f":"MAX(0,tape!BW19)","v":647.63156602882304},{"$f":"MAX(0,tape!BX19)","v":784.27983078318562},{"$f":"MAX(0,tape!BY19)","v":0}]
[null,null,"White Lane","tape",{"$f":"MAX(0,tape!BN20)","v":319.9026716335739},{"$f":"MAX(0,tape!BO20)","v":635.14505614990674},{"$f":"MAX(0,tape!BP20)","v":718.58437356428124},{"$f":"MAX(0,tape!BQ20)","v":495.53152594143319},{"$f":"MAX(0,tape!BR20)","v":191.78838714336896},{"$f":"MAX(0,tape!BS20)","v":0},"tape",{"$f":"MAX(0,tape!BT20)","v":238.14336573543721},{"$f":"MAX(0,tape!BU20)","v":475.39688033157609},{"$f":"MAX(0,tape!BV20)","v":711.76552204015161},{"$f":"MAX(0,tape!BW20)","v":947.25423204773267},{"$f":"MAX(0,tape!BX20)","v":1130.7981786610078},{"$f":"MAX(0,tape!BY20)","v":0}]
["Inverted","PCC","Yellow Edge","inverted",{"$f":"MAX(0,inverted!BN15)","v":277.39168234352775},{"$f":"MAX(0,inverted!BO15)","v":551.27597207130032},{"$f":"MAX(0,inverted!BP15)","v":644.61578064841547},{"$f":"MAX(0,inverted!BQ15)","v":467.77058893660535},{"$f":"MAX(0,inverted!BR15)","v":188.32774635554185},{"$f":"MAX(0,inverted!BS15)","v":0},"inverted",{"$f":"MAX(0,inverted!BT15)","v":206.30078919129102},{"$f":"MAX(0,inverted!BU15)","v":411.93361805086533},{"$f":"MAX(0,inverted!BV15)","v":616.90172541654863},{"$f":"MAX(0,inverted!BW15)","v":821.20832922044838},{"$f":"MAX(0,inverted!BX15)","v":986.23307150115693},{"$f":"MAX(0,inverted!BY15)","v":0}]
[null,null,"White Edge","inverted",{"$f":"MAX(0,inverted!BN16)","v":277.39168234352775},{"$f":"MAX(0,inverted!BO16)","v":551.27597207130032},{"$f":"MAX(0,inverted!BP16)","v":644.61578064841547},{"$f":"MAX(0,inverted!BQ16)","v":379.12527173821127},{"$f":"MAX(0,inverted!BR16)","v":79.349923386095213},{"$f":"MAX(0,inverted!BS16)","v":0},"inverted",{"$f":"MAX(0,inverted!BT16)","v":206.30078919129102},{"$f":"MAX(0,inverted!BU16)","v":411.93361805086533},{"$f":"MAX(0,inverted!BV16)","v":616.90172541654863},{"$f":"MAX(0,inverted!BW16)","v":665.58445172272138},{"$f":"MAX(0,inverted!BX16)","v":415.53897489278432},{"$f":"MAX(0,inverted!BY16)","v":0}]
[null,null,"White Lane","inverted",{"$f":"MAX(0,inverted!BN17)","v":375.24708686147},{"$f":"MAX(0,inverted!BO17)","v":744.08997692682556},{"$f":"MAX(0,inverted!BP17)","v":807.79031074661657},{"$f":"MAX(0,inverted!BQ17)","v":425.95367419741007},{"$f":"MAX(0,inverted!BR17)","v":82.262798307296862},{"$f":"MAX(0,inverted!BS17)","v":0},"inverted",{"$f":"MAX(0,inverted!BT17)","v":279.68967423760512},{"$f":"MAX(0,inverted!BU17)","v":558.15232825429609},{"$f":"MAX(0,inverted!BV17)","v":835.3960189258413},{"$f":"MAX(0,inverted!BW17)","v":900.8063574012466},{"$f":"MAX(0,inverted!BX17)","v":554.70131373317338},{"$f":"MAX(0,inverted!BY17)","v":0}]
[null,"AC","Yellow Edge","inverted",{"$f":"MAX(0,inverted!BN18)","v":0},{"$f":"MAX(0,inverted!BO18)","v":0},{"$f":"MAX(0,inverted!BP18)","v":0},{"$f":"MAX(0,inverted!BQ18)","v":0},{"$f":"MAX(0,inverted!BR18)","v":0},{"$f":"MAX(0,inverted!BS18)","v":0},"inverted",{"$f":"MAX(0,inverted!BT18)","v":0},{"$f":"MAX(0,inverted!BU18)","v":0},{"$f":"MAX(0,inverted!BV18)","v":0},{"$f":"MAX(0,inverted!BW18)","v":0},{"$f":"MAX(0,inverted!BX18)","v":0},{"$f":"MAX(0,inverted!BY18)","v":0}]
[null,null,"White Edge","inverted",{"$f":"MAX(0,inverted!BN19)","v":0},{"$f":"MAX(0,inverted!BO19)","v":0},{"$f":"MAX(0,inverted!BP19)","v":0},{"$f":"MAX(0,inverted!BQ19)","v":0},{"$f":"MAX(0,inverted!BR19)","v":0},{"$f":"MAX(0,inverted!BS19)","v":0},"inverted",{"$f":"MAX(0,inverted!BT19)","v":0},{"$f":"MAX(0,inverted!BU19)","v":0},{"$f":"MAX(0,inverted!BV19)","v":0},{"$f":"MAX(0,inverted!BW19)","v":0},{"$f":"MAX(0,inverted!BX19)","v":0},{"$f":"MAX(0,inverted!BY19)","v":0}]
[null,null,"White Lane","inverted",{"$f":"MAX(0,inverted!BN20)","v":0},{"$f":"MAX(0,inverted!BO20)","v":0},{"$f":"MAX(0,inverted!BP20)","v":0},{"$f":"MAX(0,inverted!BQ20)","v":0},{"$f":"MAX(0,inverted!BR20)","v":0},{"$f":"MAX(0,inverted!BS20)","v":0},"inverted",{"$f":"MAX(0,inverted!BT20)","v":0},{"$f":"MAX(0,inverted!BU20)","v":0},{"$f":"MAX(0,inverted!BV20)","v":0},{"$f":"MAX(0,inverted!BW20)","v":0},{"$f":"MAX(0,inverted!BX20)","v":0},{"$f":"MAX(0,inverted!BY20)","v":0}]
[]
[]
[]
[]
[]
[]
[]
[]
[]
[]
[]
[]
[]
[null,null,null,null,null,null,null,null,null,null,null,null,null,null,null,null,null,null,"New Stripe-PCC",null,null,null,null,null,null,null,null,null,null,null,null,null,"New Stripe-AC"]
[null,null,null,null,null,null,null,null,null,null,null,null,null,null,null,null,null,null,"off-peak application",null,null,null,null,null,null,"night time application",null,null,null,null,null,null,"off-peak application",null,null,null,null,null,null,"night time application"]
[]
[]
[null,null,null,null,"New Striping Benefit/Cost"]
["Marking Type","Pavement Type","Line Type",null,"Off-Peak Application",null,null,null,null,null,null,"Night Time Application"]
[null,null,null,null,"ADT Per Lane",null,null,null,null,"User Specified",null,"ADT Per Lane",null,null,null,null,"User Specified"]
[null,null,null,null,5000,10000,15000,20000,25000,{"$f":"IF(Input!$B$33=\"No\",\"\",Input!$B$33)","v":""},null,5000,{"$f":"F50","v":10000},{"$f":"G50","v":15000},{"$f":"H50","v":20000},{"$f":"I50","v":25000},{"$f":"IF(Input!$B$33=\"No\",\"\",Input!$B$33)","v":""}]
["Thermo (40 mil)","PCC","Yellow Edge","40 mil",{"$f":"MAX(0,'thermoplastic (40 mil)'!BN9)","v":2621.4328879583481},{"$f":"MAX(0,'thermoplastic (40 mil)'!BO9)","v":4915.8913788620193},{"$f":"MAX(0,'thermoplastic (40 mil)'!BP9)","v":2038.4560178473998},{"$f":"MAX(0,'thermoplastic (40 mil)'!BQ9)","v":708.3804241650945},{"$f":"MAX(0,'thermoplastic (40 mil)'!BR9)","v":195.64378622911002},{"$f":"MAX(0,'thermoplastic (40 mil)'!BS9)","v":0},"40 mil",{"$f":"MAX(0,'thermoplastic (40 mil)'!BT9)","v":2057.4810835189182},{"$f":"MAX(0,'thermoplastic (40 mil)'!BU9)","v":4025.220137889366},{"$f":"MAX(0,'thermoplastic (40 mil)'!BV9)","v":5811.2416583053619},{"$f":"MAX(0,'thermoplastic (40 mil)'!BW9)","v":7405.6658535886008},{"$f":"MAX(0,'thermoplastic (40 mil)'!BX9)","v":6440.8505419572884},{"$f":"MAX(0,'thermoplastic (40 mil)'!BY9)","v":0}]
[null,null,"White Edge","40 mil",{"$f":"MAX(0,'thermoplastic (40 mil)'!BN10)","v":2621.4328879583481},{"$f":"MAX(0,'thermoplastic (40 mil)'!BO10)","v":4945.5130133041512},{"$f":"MAX(0,'thermoplastic (40 mil)'!BP10)","v":2097.3226380888395},{"$f":"MAX(0,'thermoplastic (40 mil)'!BQ10)","v":750.79861993371787},{"$f":"MAX(0,'thermoplastic (40 mil)'!BR10)","v":214.35381603121775},{"$f":"MAX(0,'thermoplastic (40 mil)'!BS10)","v":0},"40 mil",{"$f":"MAX(0,'thermoplastic (40 mil)'!BT10)","v":2057.4810835189182},{"$f":"MAX(0,'thermoplastic (40 mil)'!BU10)","v":4049.474864099624},{"$f":"MAX(0,'thermoplastic (40 mil)'!BV10)","v":5979.0589439546939},{"$f":"MAX(0,'thermoplastic (40 mil)'!BW10)","v":7849.1210554242152},{"$f":"MAX(0,'thermoplastic (40 mil)'!BX10)","v":7056.8093102558132},{"$f":"MAX(0,'thermoplastic (40 mil)'!BY10)","v":0}]
[null,null,"White Lane","40 mil",{"$f":"MAX(0,'thermoplastic (40 mil)'!BN11)","v":6205.3693738070524},{"$f":"MAX(0,'thermoplastic (40 mil)'!BO11)","v":10864.429200971095},{"$f":"MAX(0,'thermoplastic (40 mil)'!BP11)","v":2479.1849936651315},{"$f":"MAX(0,'thermoplastic (40 mil)'!BQ11)","v":783.18650526312661},{"$f":"MAX(0,'thermoplastic (40 mil)'!BR11)","v":216.39775483431788},{"$f":"MAX(0,'thermoplastic (40 mil)'!BS11)","v":0},"40 mil",{"$f":"MAX(0,'thermoplastic (40 mil)'!BT11)","v":5320.5300099174683},{"$f":"MAX(0,'thermoplastic (40 mil)'!BU11)","v":10213.92034776356},{"$f":"MAX(0,'thermoplastic (40 mil)'!BV11)","v":14729.623039487173},{"$f":"MAX(0,'thermoplastic (40 mil)'!BW11)","v":18909.740028894084},{"$f":"MAX(0,'thermoplastic (40 mil)'!BX11)","v":12181.588137812227},{"$f":"MAX(0,'thermoplastic (40 mil)'!BY11)","v":0}]
[null,"AC","Yellow Edge","40 mil",{"$f":"MAX(0,'thermoplastic (40 mil)'!BN12)","v":2621.4328879583481},{"$f":"MAX(0,'thermoplastic (40 mil)'!BO12)","v":4383.3305374407473},{"$f":"MAX(0,'thermoplastic (40 mil)'!BP12)","v":1169.4154195895157},{"$f":"MAX(0,'thermoplastic (40 mil)'!BQ12)","v":214.81890672928762},{"$f":"MAX(0,'thermoplastic (40 mil)'!BR12)","v":13.28457138423494},{"$f":"MAX(0,'thermoplastic (40 mil)'!BS12)","v":0},"40 mil",{"$f":"MAX(0,'thermoplastic (40 mil)'!BT12)","v":2057.4810835189182},{"$f":"MAX(0,'thermoplastic (40 mil)'!BU12)","v":3589.1497574985669},{"$f":"MAX(0,'thermoplastic (40 mil)'!BV12)","v":3333.7759278022222},{"$f":"MAX(0,'thermoplastic (40 mil)'!BW12)","v":2245.7947566031994},{"$f":"MAX(0,'thermoplastic (40 mil)'!BX12)","v":437.34554748199184},{"$f":"MAX(0,'thermoplastic (40 mil)'!BY12)","v":0}]
[null,null,"White Edge","40 mil",{"$f":"MAX(0,'thermoplastic (40 mil)'!BN13)","v":2621.4328879583481},{"$f":"MAX(0,'thermoplastic (40 mil)'!BO13)","v":4945.5130133041512},{"$f":"MAX(0,'thermoplastic (40 mil)'!BP13)","v":2097.3226380888395},{"$f":"MAX(0,'thermoplastic (40 mil)'!BQ13)","v":726.06974610657403},{"$f":"MAX(0,'thermoplastic (40 mil)'!BR13)","v":135.86507074083858},{"$f":"MAX(0,'thermoplastic (40 mil)'!BS13)","v":0},"40 mil",{"$f":"MAX(0,'thermoplastic (40 mil)'!BT13)","v":2057.4810835189182},{"$f":"MAX(0,'thermoplastic (40 mil)'!BU13)","v":4049.474864099624},{"$f":"MAX(0,'thermoplastic (40 mil)'!BV13)","v":5979.0589439546939},{"$f":"MAX(0,'thermoplastic (40 mil)'!BW13)","v":7590.5964403274274},{"$f":"MAX(0,'thermoplastic (40 mil)'!BX13)","v":4472.8566717136582},{"$f":"MAX(0,'thermoplastic (40 mil)'!BY13)","v":0}]
[null,null,"White Lane","40 mil",{"$f":"MAX(0,'thermoplastic (40 mil)'!BN14)","v":6205.3693738070524},{"$f":"MAX(0,'thermoplastic (40 mil)'!BO14)","v":10864.429200971095},{"$f":"MAX(0,'thermoplastic (40 mil)'!BP14)","v":2479.1849936651315},{"$f":"MAX(0,'thermoplastic (40 mil)'!BQ14)","v":757.39087943541358},{"$f":"MAX(0,'thermoplastic (40 mil)'!BR14)","v":137.16059183402362},{"$f":"MAX(0,'thermoplastic (40 mil)'!BS14)","v":0},"40 mil",{"$f":"MAX(0,'thermoplastic (40 mil)'!BT14)","v":5320.5300099174683},{"$f":"MAX(0,'thermoplastic (40 mil)'!BU14)","v":10213.92034776356},{"$f":"MAX(0,'thermoplastic (40 mil)'!BV14)","v":14729.623039487173},{"$f":"MAX(0,'thermoplastic (40 mil)'!BW14)","v":18286.914463072058},{"$f":"MAX(0,'thermoplastic (40 mil)'!BX14)","v":7721.1237230252173},{"$f":"MAX(0,'thermoplastic (40 mil)'!BY14)","v":0}]
["Thermo (90 mil)","PCC","Yellow Edge","90 mil",{"$f":"MAX(0,'thermoplastic (90 mil)'!BN9)","v":1157.5001661702681},{"$f":"MAX(0,'thermoplastic (90 mil)'!BO9)","v":2255.1296158428609},{"$f":"MAX(0,'thermoplastic (90 mil)'!BP9)","v":1568.3362625984125},{"$f":"MAX(0,'thermoplastic (90 mil)'!BQ9)","v":688.45390355449797},{"$f":"MAX(0,'thermoplastic (90 mil)'!BR9)","v":210.01008742129969},{"$f":"MAX(0,'thermoplastic (90 mil)'!BS9)","v":0},"90 mil",{"$f":"MAX(0,'thermoplastic (90 mil)'!BT9)","v":878.13952442773405},{"$f":"MAX(0,'thermoplastic (90 mil)'!BU9)","v":1744.2399962603495},{"$f":"MAX(0,'thermoplastic (90 mil)'!BV9)","v":2598.547308112873},{"$f":"MAX(0,'thermoplastic (90 mil)'!BW9)","v":3441.3007015435614},{"$f":"MAX(0,'thermoplastic (90 mil)'!BX9)","v":3673.0257429457693},{"$f":"MAX(0,'thermoplastic (90 mil)'!BY9)","v":0}]
[null,null,"White Edge","90 mil",{"$f":"MAX(0,'thermoplastic (90 mil)'!BN10)","v":1157.5001661702681},{"$f":"MAX(0,'thermoplastic (90 mil)'!BO10)","v":2255.1296158428609},{"$f":"MAX(0,'thermoplastic (90 mil)'!BP10)","v":1568.3362625984125},{"$f":"MAX(0,'thermoplastic (90 mil)'!BQ10)","v":688.45390355449797},{"$f":"MAX(0,'thermoplastic (90 mil)'!BR10)","v":210.01008742129969},{"$f":"MAX(0,'thermoplastic (90 mil)'!BS10)","v":0},"90 mil",{"$f":"MAX(0,'thermoplastic (90 mil)'!BT10)","v":878.13952442773405},{"$f":"MAX(0,'thermoplastic (90 mil)'!BU10)","v":1744.2399962603495},{"$f":"MAX(0,'thermoplastic (90 mil)'!BV10)","v":2598.547308112873},{"$f":"MAX(0,'thermoplastic (90 mil)'!BW10)","v":3441.3007015435614},{"$f":"MAX(0,'thermoplastic (90 mil)'!BX10)","v":3673.0257429457693},{"$f":"MAX(0,'thermoplastic (90 mil)'!BY10)","v":0}]
[null,null,"White Lane","90 mil",{"$f":"MAX(0,'thermoplastic (90 mil)'!BN11)","v":3268.0725231251804},{"$f":"MAX(0,'thermoplastic (90 mil)'!BO11)","v":6080.3768003172318},{"$f":"MAX(0,'thermoplastic (90 mil)'!BP11)","v":2214.1608917149697},{"$f":"MAX(0,'thermoplastic (90 mil)'!BQ11)","v":761.58847797474539},{"$f":"MAX(0,'thermoplastic (90 mil)'!BR11)","v":215.04969214877042},{"$f":"MAX(0,'thermoplastic (90 mil)'!BS11)","v":0},"90 mil",{"$f":"MAX(0,'thermoplastic (90 mil)'!BT11)","v":2604.769019502427},{"$f":"MAX(0,'thermoplastic (90 mil)'!BU11)","v":5105.0204813421715},{"$f":"MAX(0,'thermoplastic (90 mil)'!BV11)","v":7506.9213815137555},{"$f":"MAX(0,'thermoplastic (90 mil)'!BW11)","v":9816.1629011865789},{"$f":"MAX(0,'thermoplastic (90 mil)'!BX11)","v":8245.1716659681115},{"$f":"MAX(0,'thermoplastic (90 mil)'!BY11)","v":0}]
[null,"AC","Yellow Edge","90 mil",{"$f":"MAX(0,'thermoplastic (90 mil)'!BN12)","v":1157.5001661702681},{"$f":"MAX(0,'thermoplastic (90 mil)'!BO12)","v":2255.1296158428609},{"$f":"MAX(0,'thermoplastic (90 mil)'!BP12)","v":1568.3362625984125},{"$f":"MAX(0,'thermoplastic (90 mil)'!BQ12)","v":688.45390355449797},{"$f":"MAX(0,'thermoplastic (90 mil)'!BR12)","v":210.01008742129969},{"$f":"MAX(0,'thermoplastic (90 mil)'!BS12)","v":0},"90 mil",{"$f":"MAX(0,'thermoplastic (90 mil)'!BT12)","v":878.13952442773405},{"$f":"MAX(0,'thermoplastic (90 mil)'!BU12)","v":1744.2399962603495},{"$f":"MAX(0,'thermoplastic (90 mil)'!BV12)","v":2598.547308112873},{"$f":"MAX(0,'thermoplastic (90 mil)'!BW12)","v":3441.3007015435614},{"$f":"MAX(0,'thermoplastic (90 mil)'!BX12)","v":3673.0257429457693},{"$f":"MAX(0,'thermoplastic (90 mil)'!BY12)","v":0}]
[null,null,"White Edge","90 mil",{"$f":"MAX(0,'thermoplastic (90 mil)'!BN13)","v":1157.5001661702681},{"$f":"MAX(0,'thermoplastic (90 mil)'!BO13)","v":2255.1296158428609},{"$f":"MAX(0,'thermoplastic (90 mil)'!BP13)","v":1568.3362625984125},{"$f":"MAX(0,'thermoplastic (90 mil)'!BQ13)","v":688.45390355449797},{"$f":"MAX(0,'thermoplastic (90 mil)'!BR13)","v":210.01008742129969},{"$f":"MAX(0,'thermoplastic (90 mil)'!BS13)","v":0},"90 mil",{"$f":"MAX(0,'thermoplastic (90 mil)'!BT13)","v":878.13952442773405},{"$f":"MAX(0,'thermoplastic (90 mil)'!BU13)","v":1744.2399962603495},{"$f":"MAX(0,'thermoplastic (90 mil)'!BV13)","v":2598.547308112873},{"$f":"MAX(0,'thermoplastic (90 mil)'!BW13)","v":3441.3007015435614},{"$f":"MAX(0,'thermoplastic (90 mil)'!BX13)","v":3673.0257429457693},{"$f":"MAX(0,'thermoplastic (90 mil)'!BY13)","v":0}]
[null,null,"White Lane","90 mil",{"$f":"MAX(0,'thermoplastic (90 mil)'!BN14)","v":3268.0725231251804},{"$f":"MAX(0,'thermoplastic (90 mil)'!BO14)","v":6080.3768003172318},{"$f":"MAX(0,'thermoplastic (90 mil)'!BP14)","v":2214.1608917149697},{"$f":"MAX(0,'thermoplastic (90 mil)'!BQ14)","v":761.58847797474539},{"$f":"MAX(0,'thermoplastic (90 mil)'!BR14)","v":215.04969214877042},{"$f":"MAX(0,'thermoplastic (90 mil)'!BS14)","v":0},"90 mil",{"$f":"MAX(0,'thermoplastic (90 mil)'!BT14)","v":2604.769019502427},{"$f":"MAX(0,'thermoplastic (90 mil)'!BU14)","v":5105.0204813421715},{"$f":"MAX(0,'thermoplastic (90 mil)'!BV14)","v":7506.9213815137555},{"$f":"MAX(0,'thermoplastic (90 mil)'!BW14)","v":9816.1629011865789},{"$f":"MAX(0,'thermoplastic (90 mil)'!BX14)","v":8245.1716659681115},{"$f":"MAX(0,'thermoplastic (90 mil)'!BY14)","v":0}]
["Tape","PCC","Yellow Edge","tape",{"$f":"MAX(0,tape!BN9)","v":359.07535434026425},{"$f":"MAX(0,tape!BO9)","v":712.28445353387792},{"$f":"MAX(0,tape!BP9)","v":782.50218929598645},{"$f":"MAX(0,tape!BQ9)","v":517.38943972882851},{"$f":"MAX(0,tape!BR9)","v":194.33037126276548},{"$f":"MAX(0,tape!BS9)","v":0},"tape",{"$f":"MAX(0,tape!BT9)","v":267.53911528881173},{"$f":"MAX(0,tape!BU9)","v":533.95539849198178},{"$f":"MAX(0,tape!BV9)","v":799.25590341067016},{"$f":"MAX(0,tape!BW9)","v":1063.4476248854403},{"$f":"MAX(0,tape!BX9)","v":1262.5384230069697},{"$f":"MAX(0,tape!BY9)","v":0}]
[null,null,"White Edge","tape",{"$f":"MAX(0,tape!BN10)","v":359.07535434026425},{"$f":"MAX(0,tape!BO10)","v":712.28445353387792},{"$f":"MAX(0,tape!BP10)","v":782.50218929598645},{"$f":"MAX(0,tape!BQ10)","v":517.38943972882851},{"$f":"MAX(0,tape!BR10)","v":194.33037126276548},{"$f":"MAX(0,tape!BS10)","v":0},"tape",{"$f":"MAX(0,tape!BT10)","v":267.53911528881173},{"$f":"MAX(0,tape!BU10)","v":533.95539849198178},{"$f":"MAX(0,tape!BV10)","v":799.25590341067016},{"$f":"MAX(0,tape!BW10)","v":1063.4476248854403},{"$f":"MAX(0,tape!BX10)","v":1262.5384230069697},{"$f":"MAX(0,tape!BY10)","v":0}]
[null,null,"White Lane","tape",{"$f":"MAX(0,tape!BN11)","v":745.73953698249215},{"$f":"MAX(0,tape!BO11)","v":1466.3971605185407},{"$f":"MAX(0,tape!BP11)","v":1255.2957327135687},{"$f":"MAX(0,tape!BQ11)","v":636.21929999024212},{"$f":"MAX(0,tape!BR11)","v":205.88501592907133},{"$f":"MAX(0,tape!BS11)","v":0},"tape",{"$f":"MAX(0,tape!BT11)","v":560.49061312740764},{"$f":"MAX(0,tape!BU11)","v":1116.0644531685964},{"$f":"MAX(0,tape!BV11)","v":1666.7859344601991},{"$f":"MAX(0,tape!BW11)","v":2212.7183510468817},{"$f":"MAX(0,tape!BX11)","v":2491.7082026772614},{"$f":"MAX(0,tape!BY11)","v":0}]
[null,"AC","Yellow Edge","tape",{"$f":"MAX(0,tape!BN12)","v":359.07535434026425},{"$f":"MAX(0,tape!BO12)","v":712.28445353387792},{"$f":"MAX(0,tape!BP12)","v":782.50218929598645},{"$f":"MAX(0,tape!BQ12)","v":517.38943972882851},{"$f":"MAX(0,tape!BR12)","v":194.33037126276548},{"$f":"MAX(0,tape!BS12)","v":0},"tape",{"$f":"MAX(0,tape!BT12)","v":267.53911528881173},{"$f":"MAX(0,tape!BU12)","v":533.95539849198178},{"$f":"MAX(0,tape!BV12)","v":799.25590341067016},{"$f":"MAX(0,tape!BW12)","v":1063.4476248854403},{"$f":"MAX(0,tape!BX12)","v":1262.5384230069697},{"$f":"MAX(0,tape!BY12)","v":0}]
[null,null,"White Edge","tape",{"$f":"MAX(0,tape!BN13)","v":359.07535434026425},{"$f":"MAX(0,tape!BO13)","v":712.28445353387792},{"$f":"MAX(0,tape!BP13)","v":782.50218929598645},{"$f":"MAX(0,tape!BQ13)","v":517.38943972882851},{"$f":"MAX(0,tape!BR13)","v":194.33037126276548},{"$f":"MAX(0,tape!BS13)","v":0},"tape",{"$f":"MAX(0,tape!BT13)","v":267.53911528881173},{"$f":"MAX(0,tape!BU13)","v":533.95539849198178},{"$f":"MAX(0,tape!BV13)","v":799.25590341067016},{"$f":"MAX(0,tape!BW13)","v":1063.4476248854403},{"$f":"MAX(0,tape!BX13)","v":1262.5384230069697},{"$f":"MAX(0,tape!BY13)","v":0}]
[null,null,"White Lane","tape",{"$f":"MAX(0,tape!BN14)","v":745.73953698249215},{"$f":"MAX(0,tape!BO14)","v":1466.3971605185407},{"$f":"MAX(0,tape!BP14)","v":1255.2957327135687},{"$f":"MAX(0,tape!BQ14)","v":636.21929999024212},{"$f":"MAX(0,tape!BR14)","v":205.88501592907133},{"$f":"MAX(0,tape!BS14)","v":0},"tape",{"$f":"MAX(0,tape!BT14)","v":560.49061312740764},{"$f":"MAX(0,tape!BU14)","v":1116.0644531685964},{"$f":"MAX(0,tape!BV14)","v":1666.7859344601991},{"$f":"MAX(0,tape!BW14)","v":2212.7183510468817},{"$f":"MAX(0,tape!BX14)","v":2491.7082026772614},{"$f":"MAX(0,tape!BY14)","v":0}]
["Inverted","PCC","Yellow Edge","inverted",{"$f":"MAX(0,inverted!BN9)","v":549.44730061588325},{"$f":"MAX(0,inverted!BO9)","v":1085.2184125814895},{"$f":"MAX(0,inverted!BP9)","v":1045.6841677198261},{"$f":"MAX(0,inverted!BQ9)","v":591.17374940311822},{"$f":"MAX(0,inverted!BR9)","v":201.90224081222073},{"$f":"MAX(0,inverted!BS9)","v":0},"inverted",{"$f":"MAX(0,inverted!BT9)","v":411.13498252182967},{"$f":"MAX(0,inverted!BU9)","v":819.62134149719918},{"$f":"MAX(0,inverted!BV9)","v":1225.4845892861929},{"$f":"MAX(0,inverted!BW9)","v":1628.7499116403176},{"$f":"MAX(0,inverted!BX9)","v":1883.3842293288292},{"$f":"MAX(0,inverted!BY9)","v":0}]
[null,null,"White Edge","inverted",{"$f":"MAX(0,inverted!BN10)","v":549.44730061588325},{"$f":"MAX(0,inverted!BO10)","v":1085.2184125814895},{"$f":"MAX(0,inverted!BP10)","v":1045.6841677198261},{"$f":"MAX(0,inverted!BQ10)","v":479.14279710588966},{"$f":"MAX(0,inverted!BR10)","v":85.069394446450445},{"$f":"MAX(0,inverted!BS10)","v":0},"inverted",{"$f":"MAX(0,inverted!BT10)","v":411.13498252182967},{"$f":"MAX(0,inverted!BU10)","v":819.62134149719918},{"$f":"MAX(0,inverted!BV10)","v":1225.4845892861929},{"$f":"MAX(0,inverted!BW10)","v":1320.0920866957495},{"$f":"MAX(0,inverted!BX10)","v":793.54421850131632},{"$f":"MAX(0,inverted!BY10)","v":0}]
[null,null,"White Lane","inverted",{"$f":"MAX(0,inverted!BN11)","v":1136.4788837122676},{"$f":"MAX(0,inverted!BO11)","v":2215.2147998039354},{"$f":"MAX(0,inverted!BP11)","v":1555.3429208508564},{"$f":"MAX(0,inverted!BQ11)","v":556.45731632776824},{"$f":"MAX(0,inverted!BR11)","v":88.426199714764778},{"$f":"MAX(0,inverted!BS11)","v":0},"inverted",{"$f":"MAX(0,inverted!BT11)","v":861.77833820180638},{"$f":"MAX(0,inverted!BU11)","v":1711.9605783413704},{"$f":"MAX(0,inverted!BV11)","v":2550.7792120336921},{"$f":"MAX(0,inverted!BW11)","v":2738.2221265719922},{"$f":"MAX(0,inverted!BX11)","v":1523.3960999476494},{"$f":"MAX(0,inverted!BY11)","v":0}]
[null,"AC","Yellow Edge","inverted",{"$f":"MAX(0,inverted!BN12)","v":0},{"$f":"MAX(0,inverted!BO12)","v":0},{"$f":"MAX(0,inverted!BP12)","v":0},{"$f":"MAX(0,inverted!BQ12)","v":0},{"$f":"MAX(0,inverted!BR12)","v":0},{"$f":"MAX(0,inverted!BS12)","v":0},"inverted",{"$f":"MAX(0,inverted!BT12)","v":0},{"$f":"MAX(0,inverted!BU12)","v":0},{"$f":"MAX(0,inverted!BV12)","v":0},{"$f":"MAX(0,inverted!BW12)","v":0},{"$f":"MAX(0,inverted!BX12)","v":0},{"$f":"MAX(0,inverted!BY12)","v":0}]
[null,null,"White Edge","inverted",{"$f":"MAX(0,inverted!BN13)","v":0},{"$f":"MAX(0,inverted!BO13)","v":0},{"$f":"MAX(0,inverted!BP13)","v":0},{"$f":"MAX(0,inverted!BQ13)","v":0},{"$f":"MAX(0,inverted!BR13)","v":0},{"$f":"MAX(0,inverted!BS13)","v":0},"inverted",{"$f":"MAX(0,inverted!BT13)","v":0},{"$f":"MAX(0,inverted!BU13)","v":0},{"$f":"MAX(0,inverted!BV13)","v":0},{"$f":"MAX(0,inverted!BW13)","v":0},{"$f":"MAX(0,inverted!BX13)","v":0},{"$f":"MAX(0,inverted!BY13)","v":0}]
[null,null,"White Lane","inverted",{"$f":"MAX(0,inverted!BN14)","v":0},{"$f":"MAX(0,inverted!BO14)","v":0},{"$f":"MAX(0,inverted!BP14)","v":0},{"$f":"MAX(0,inverted!BQ14)","v":0},{"$f":"MAX(0,inverted!BR14)","v":0},{"$f":"MAX(0,inverted!BS14)","v":0},"inverted",{"$f":"MAX(0,inverted!BT14)","v":0},{"$f":"MAX(0,inverted!BU14)","v":0},{"$f":"MAX(0,inverted!BV14)","v":0},{"$f":"MAX(0,inverted!BW14)","v":0},{"$f":"MAX(0,inverted!BX14)","v":0},{"$f":"MAX(0,inverted!BY14)","v":0}]
[]
[]
[]
[]
[]
[]
[]
[]
[]
[]
[]
[]
[]
[]
[]
[]
[]
[]
[]
[]
[]
[]
[]
["Marking Type","Pavement Type","Line Type",null,"PM Costs",null,null,null,null,null,null,null,"User Cost"]
[null,null,null,null,"Average Costs",null,null,"Off-Peak Application",null,null,"Night Time Application",null,"Off-Peak Application",null,null,null,null,null,"Night Time Application"]
[null,null,null,null,"Application","Removal",null,"Application","Removal",null,"Application","Removal",5000,10000,15000,20000,25000,{"$f":"IF(Input!$B$33=\"No\",\"\",Input!$B$33)","v":""},5000,10000,15000,20000,25000,{"$f":"IF(Input!$B$33=\"No\",\"\",Input!$B$33)","v":""}]
["Thermo (40 mil)","PCC","Yellow Edge","40 mil",{"$f":"Input!$B19","v":1039},{"$f":"Input!$D19","v":5250},"40 mil",{"$f":"E101*(1-Input!$B$23/100)","v":883.15},{"$f":"F101*(1-Input!$B$23/100)","v":4462.5},"40 mil",{"$f":"E101*(1+Input!$B$24/100)","v":1194.8499999999999},{"$f":"F101*(1+Input!$B$24/100)","v":6037.4999999999991},{"$f":"Input!C28","v":70.526903758950084},{"$f":"Input!C29","v":127.86745896720328},{"$f":"Input!C30","v":2692.8377206276123},{"$f":"Input!C31","v":12436.000747617014},{"$f":"Input!C32","v":57431.650414747659},{"$f":"Input!C33","v":""},{"$f":"Input!D28","v":20.227999999999998},{"$f":"Input!D29","v":39.878},{"$f":"Input!D30","v":59.528000000000006},{"$f":"Input!D31","v":79.177999999999997},{"$f":"Input!D32","v":576.48878080473003},{"$f":"Input!D33","v":""}]
[null,null,"White Edge","40 mil",{"$f":"Input!$B19","v":1039},{"$f":"Input!$D19","v":5250},"40 mil",{"$f":"E102*(1-Input!$B$23/100)","v":883.15},{"$f":"F102*(1-Input!$B$23/100)","v":4462.5},"40 mil",{"$f":"E102*(1+Input!$B$24/100)","v":1194.8499999999999},{"$f":"F102*(1+Input!$B$24/100)","v":6037.4999999999991}]
[null,null,"White Lane","40 mil",{"$f":"Input!$C19","v":391},{"$f":"Input!$E19","v":5250},"40 mil",{"$f":"E103*(1-Input!$B$23/100)","v":332.34999999999997},{"$f":"F103*(1-Input!$B$23/100)","v":4462.5},"40 mil",{"$f":"E103*(1+Input!$B$24/100)","v":449.65},{"$f":"F103*(1+Input!$B$24/100)","v":6037.4999999999991}]
[null,"AC","Yellow Edge","40 mil",{"$f":"Input!$B19","v":1039},{"$f":"Input!$D19","v":5250},"40 mil",{"$f":"E104*(1-Input!$B$23/100)","v":883.15},{"$f":"F104*(1-Input!$B$23/100)","v":4462.5},"40 mil",{"$f":"E104*(1+Input!$B$24/100)","v":1194.8499999999999},{"$f":"F104*(1+Input!$B$24/100)","v":6037.4999999999991}]
[null,null,"White Edge","40 mil",{"$f":"Input!$B19","v":1039},{"$f":"Input!$D19","v":5250},"40 mil",{"$f":"E105*(1-Input!$B$23/100)","v":883.15},{"$f":"F105*(1-Input!$B$23/100)","v":4462.5},"40 mil",{"$f":"E105*(1+Input!$B$24/100)","v":1194.8499999999999},{"$f":"F105*(1+Input!$B$24/100)","v":6037.4999999999991}]
[null,null,"White Lane","40 mil",{"$f":"Input!$C19","v":391},{"$f":"Input!$E19","v":5250},"40 mil",{"$f":"E106*(1-Input!$B$23/100)","v":332.34999999999997},{"$f":"F106*(1-Input!$B$23/100)","v":4462.5},"40 mil",{"$f":"E106*(1+Input!$B$24/100)","v":449.65},{"$f":"F106*(1+Input!$B$24/100)","v":6037.4999999999991}]
["Thermo (90 mil)","PCC","Yellow Edge","90 mil",{"$f":"Input!$B20","v":2458},{"$f":"Input!$D20","v":5250},"90 mil",{"$f":"E107*(1-Input!$B$23/100)","v":2089.2999999999997},{"$f":"F107*(1-Input!$B$23/100)","v":4462.5},"90 mil",{"$f":"E107*(1+Input!$B$24/100)","v":2826.7},{"$f":"F107*(1+Input!$B$24/100)","v":6037.4999999999991}]
[null,null,"White Edge","90 mil",{"$f":"Input!$B20","v":2458},{"$f":"Input!$D20","v":5250},"90 mil",{"$f":"E108*(1-Input!$B$23/100)","v":2089.2999999999997},{"$f":"F108*(1-Input!$B$23/100)","v":4462.5},"90 mil",{"$f":"E108*(1+Input!$B$24/100)","v":2826.7},{"$f":"F108*(1+Input!$B$24/100)","v":6037.4999999999991}]
[null,null,"White Lane","90 mil",{"$f":"Input!$C20","v":817},{"$f":"Input!$E20","v":5250},"90 mil",{"$f":"E109*(1-Input!$B$23/100)","v":694.44999999999993},{"$f":"F109*(1-Input!$B$23/100)","v":4462.5},"90 mil",{"$f":"E109*(1+Input!$B$24/100)","v":939.55},{"$f":"F109*(1+Input!$B$24/100)","v":6037.4999999999991}]
[null,"AC","Yellow Edge","90 mil",{"$f":"Input!$B20","v":2458},{"$f":"Input!$D20","v":5250},"90 mil",{"$f":"E110*(1-Input!$B$23/100)","v":2089.2999999999997},{"$f":"F110*(1-Input!$B$23/100)","v":4462.5},"90 mil",{"$f":"E110*(1+Input!$B$24/100)","v":2826.7},{"$f":"F110*(1+Input!$B$24/100)","v":6037.4999999999991}]
[null,null,"White Edge","90 mil",{"$f":"Input!$B20","v":2458},{"$f":"Input!$D20","v":5250},"90 mil",{"$f":"E111*(1-Input!$B$23/100)","v":2089.2999999999997},{"$f":"F111*(1-Input!$B$23/100)","v":4462.5},"90 mil",{"$f":"E111*(1+Input!$B$24/100)","v":2826.7},{"$f":"F111*(1+Input!$B$24/100)","v":6037.4999999999991}]
[null,null,"White Lane","90 mil",{"$f":"Input!$C20","v":817},{"$f":"Input!$E20","v":5250},"90 mil",{"$f":"E112*(1-Input!$B$23/100)","v":694.44999999999993},{"$f":"F112*(1-Input!$B$23/100)","v":4462.5},"90 mil",{"$f":"E112*(1+Input!$B$24/100)","v":939.55},{"$f":"F112*(1+Input!$B$24/100)","v":6037.4999999999991}]
["Tape","PCC","Yellow Edge","tape",{"$f":"Input!$B21","v":8108},{"$f":"Input!$D21","v":5250},"tape",{"$f":"E113*(1-Input!$B$23/100)","v":6891.8},{"$f":"F113*(1-Input!$B$23/100)","v":4462.5},"tape",{"$f":"E113*(1+Input!$B$24/100)","v":9324.1999999999989},{"$f":"F113*(1+Input!$B$24/100)","v":6037.4999999999991}]
[null,null,"White Edge","tape",{"$f":"Input!$B21","v":8108},{"$f":"Input!$D21","v":5250},"tape",{"$f":"E114*(1-Input!$B$23/100)","v":6891.8},{"$f":"F114*(1-Input!$B$23/100)","v":4462.5},"tape",{"$f":"E114*(1+Input!$B$24/100)","v":9324.1999999999989},{"$f":"F114*(1+Input!$B$24/100)","v":6037.4999999999991}]
[null,null,"White Lane","tape",{"$f":"Input!$C21","v":3861},{"$f":"Input!$E21","v":5250},"tape",{"$f":"E115*(1-Input!$B$23/100)","v":3281.85},{"$f":"F115*(1-Input!$B$23/100)","v":4462.5},"tape",{"$f":"E115*(1+Input!$B$24/100)","v":4440.1499999999996},{"$f":"F115*(1+Input!$B$24/100)","v":6037.4999999999991}]
[null,"AC","Yellow Edge","tape",{"$f":"Input!$B21","v":8108},{"$f":"Input!$D21","v":5250},"tape",{"$f":"E116*(1-Input!$B$23/100)","v":6891.8},{"$f":"F116*(1-Input!$B$23/100)","v":4462.5},"tape",{"$f":"E116*(1+Input!$B$24/100)","v":9324.1999999999989},{"$f":"F116*(1+Input!$B$24/100)","v":6037.4999999999991}]
[null,null,"White Edge","tape",{"$f":"Input!$B21","v":8108},{"$f":"Input!$D21","v":5250},"tape",{"$f":"E117*(1-Input!$B$23/100)","v":6891.8},{"$f":"F117*(1-Input!$B$23/100)","v":4462.5},"tape",{"$f":"E117*(1+Input!$B$24/100)","v":9324.1999999999989},{"$f":"F117*(1+Input!$B$24/100)","v":6037.4999999999991}]
[null,null,"White Lane","tape",{"$f":"Input!$C21","v":3861},{"$f":"Input!$E21","v":5250},"tape",{"$f":"E118*(1-Input!$B$23/100)","v":3281.85},{"$f":"F118*(1-Input!$B$23/100)","v":4462.5},"tape",{"$f":"E118*(1+Input!$B$24/100)","v":4440.1499999999996},{"$f":"F118*(1+Input!$B$24/100)","v":6037.4999999999991}]
["Inverted","PCC","Yellow Edge","inverted",{"$f":"Input!$B22","v":5270},{"$f":"Input!$D22","v":5250},"inverted",{"$f":"E119*(1-Input!$B$23/100)","v":4479.5},{"$f":"F119*(1-Input!$B$23/100)","v":4462.5},"inverted",{"$f":"E119*(1+Input!$B$24/100)","v":6060.4999999999991},{"$f":"F119*(1+Input!$B$24/100)","v":6037.4999999999991}]
[null,null,"White Edge","inverted",{"$f":"Input!$B22","v":5270},{"$f":"Input!$D22","v":5250},"inverted",{"$f":"E120*(1-Input!$B$23/100)","v":4479.5},{"$f":"F120*(1-Input!$B$23/100)","v":4462.5},"inverted",{"$f":"E120*(1+Input!$B$24/100)","v":6060.4999999999991},{"$f":"F120*(1+Input!$B$24/100)","v":6037.4999999999991}]
[null,null,"White Lane","inverted",{"$f":"Input!$C22","v":2505},{"$f":"Input!$E22","v":5250},"inverted",{"$f":"E121*(1-Input!$B$23/100)","v":2129.25},{"$f":"F121*(1-Input!$B$23/100)","v":4462.5},"inverted",{"$f":"E121*(1+Input!$B$24/100)","v":2880.75},{"$f":"F121*(1+Input!$B$24/100)","v":6037.4999999999991}]
[null,"AC","Yellow Edge","inverted",null,null,"inverted",null,null,"inverted"]
[null,null,"White Edge","inverted",null,null,"inverted",null,null,"inverted"]
[null,null,"White Lane","inverted",null,null,"inverted",null,null,"inverted"]
[]
[]
[]
[]
[]
[]
[]
[]
[]
[]
[]
[]
[]
[]
[]
[]
[]
[]
[]
[]
[]
[]
[]
[]
[]
[]
[]
[]
[]
[]
[]
[]
[]
[]
[]
[]
[]
["Marking Type","Pavement Type","Line Type"]
[null,null,null,null,"Utility",null,null,null,null,null,null,"Marking Service Life (month retro reaches 100)"]
[null,null,null,null,5000,10000,15000,20000,25000,{"$f":"IF(Input!$B$33=\"No\",\"\",Input!$B$33)","v":""},null,5000,10000,15000,20000,25000,{"$f":"IF(Input!$B$33=\"No\",\"\",Input!$B$33)","v":""}]
["Thermo (40 mil)","PCC","Yellow Edge","40 mil",{"$f":"'thermoplastic (40 mil)'!CA9","v":2500000},{"$f":"'thermoplastic (40 mil)'!CB9","v":4970052.0104158605},{"$f":"'thermoplastic (40 mil)'!CC9","v":7289493.6888617631},{"$f":"'thermoplastic (40 mil)'!CD9","v":9435025.6561157759},{"$f":"'thermoplastic (40 mil)'!CE9","v":11408928.346336108},{"$f":"'thermoplastic (40 mil)'!CF9","v":0},"40 mil",{"$f":"'thermoplastic (40 mil)'!AZ10","v":48.457464784274393},{"$f":"'thermoplastic (40 mil)'!BA10","v":31.987426591483928},{"$f":"'thermoplastic (40 mil)'!BB10","v":23.873235940460095},{"$f":"'thermoplastic (40 mil)'!BC10","v":19.042707867082733},{"$f":"'thermoplastic (40 mil)'!BD10","v":15.838029383078949},{"$f":"'thermoplastic (40 mil)'!BE10","v":0}]
[null,null,"White Edge","40 mil",{"$f":"'thermoplastic (40 mil)'!CA10","v":2500000},{"$f":"'thermoplastic (40 mil)'!CB10","v":5000000},{"$f":"'thermoplastic (40 mil)'!CC10","v":7500000},{"$f":"'thermoplastic (40 mil)'!CD10","v":10000000},{"$f":"'thermoplastic (40 mil)'!CE10","v":12500000},{"$f":"'thermoplastic (40 mil)'!CF10","v":0},"40 mil",{"$f":"'thermoplastic (40 mil)'!AZ9","v":74.905115997046877},{"$f":"'thermoplastic (40 mil)'!BA9","v":49.445878152083843},{"$f":"'thermoplastic (40 mil)'!BB9","v":36.903034760608328},{"$f":"'thermoplastic (40 mil)'!BC9","v":29.436047635422497},{"$f":"'thermoplastic (40 mil)'!BD9","v":24.482284275201376},{"$f":"'thermoplastic (40 mil)'!BE9","v":0}]
[null,null,"White Lane","40 mil",{"$f":"'thermoplastic (40 mil)'!CA11","v":2500000},{"$f":"'thermoplastic (40 mil)'!CB11","v":5000000},{"$f":"'thermoplastic (40 mil)'!CC11","v":7500000},{"$f":"'thermoplastic (40 mil)'!CD11","v":10000000},{"$f":"'thermoplastic (40 mil)'!CE11","v":12500000},{"$f":"'thermoplastic (40 mil)'!CF11","v":0},"40 mil",{"$f":"'thermoplastic (40 mil)'!AZ9","v":74.905115997046877},{"$f":"'thermoplastic (40 mil)'!BA9","v":49.445878152083843},{"$f":"'thermoplastic (40 mil)'!BB9","v":36.903034760608328},{"$f":"'thermoplastic (40 mil)'!BC9","v":29.436047635422497},{"$f":"'thermoplastic (40 mil)'!BD9","v":24.482284275201376},{"$f":"'thermoplastic (40 mil)'!BE9","v":0}]
[null,"AC","Yellow Edge","40 mil",{"$f":"'thermoplastic (40 mil)'!CA12","v":2500000},{"$f":"'thermoplastic (40 mil)'!CB12","v":4431623.7017766898},{"$f":"'thermoplastic (40 mil)'!CC12","v":4181815.1807646956},{"$f":"'thermoplastic (40 mil)'!CD12","v":2861205.4021656606},{"$f":"'thermoplastic (40 mil)'!CE12","v":774687.12886712863},{"$f":"'thermoplastic (40 mil)'!CF12","v":0},"40 mil",{"$f":"'thermoplastic (40 mil)'!AZ12","v":52.516958424964116},{"$f":"'thermoplastic (40 mil)'!BA12","v":40.910897818903514},{"$f":"'thermoplastic (40 mil)'!BB12","v":29.304837212842905},{"$f":"'thermoplastic (40 mil)'!BC12","v":17.6987766067823},{"$f":"'thermoplastic (40 mil)'!BD12","v":6.0927160007216949},{"$f":"'thermoplastic (40 mil)'!BE12","v":0}]
[null,null,"White Edge","40 mil",{"$f":"'thermoplastic (40 mil)'!CA13","v":2500000},{"$f":"'thermoplastic (40 mil)'!CB13","v":5000000},{"$f":"'thermoplastic (40 mil)'!CC13","v":7500000},{"$f":"'thermoplastic (40 mil)'!CD13","v":9670632.4016774707},{"$f":"'thermoplastic (40 mil)'!CE13","v":7922944.4835875742},{"$f":"'thermoplastic (40 mil)'!CF13","v":0},"40 mil",{"$f":"'thermoplastic (40 mil)'!AZ11","v":78.626049334055054},{"$f":"'thermoplastic (40 mil)'!BA11","v":67.019988727994445},{"$f":"'thermoplastic (40 mil)'!BB11","v":55.413928121933843},{"$f":"'thermoplastic (40 mil)'!BC11","v":43.807867515873241},{"$f":"'thermoplastic (40 mil)'!BD11","v":32.201806909812632},{"$f":"'thermoplastic (40 mil)'!BE11","v":0}]
[null,null,"White Lane","40 mil",{"$f":"'thermoplastic (40 mil)'!CA14","v":2500000},{"$f":"'thermoplastic (40 mil)'!CB14","v":5000000},{"$f":"'thermoplastic (40 mil)'!CC14","v":7500000},{"$f":"'thermoplastic (40 mil)'!CD14","v":9670632.4016774707},{"$f":"'thermoplastic (40 mil)'!CE14","v":7922944.4835875742},{"$f":"'thermoplastic (40 mil)'!CF14","v":0},"40 mil",{"$f":"'thermoplastic (40 mil)'!AZ11","v":78.626049334055054},{"$f":"'thermoplastic (40 mil)'!BA11","v":67.019988727994445},{"$f":"'thermoplastic (40 mil)'!BB11","v":55.413928121933843},{"$f":"'thermoplastic (40 mil)'!BC11","v":43.807867515873241},{"$f":"'thermoplastic (40 mil)'!BD11","v":32.201806909812632},{"$f":"'thermoplastic (40 mil)'!BE11","v":0}]
["Thermo (90 mil)","PCC","Yellow Edge","90 mil",{"$f":"'thermoplastic (90 mil)'!CA9","v":2500000},{"$f":"'thermoplastic (90 mil)'!CB9","v":5000000},{"$f":"'thermoplastic (90 mil)'!CC9","v":7500000},{"$f":"'thermoplastic (90 mil)'!CD9","v":10000000},{"$f":"'thermoplastic (90 mil)'!CE9","v":12500000},{"$f":"'thermoplastic (90 mil)'!CF9","v":0},"90 mil",{"$f":"'thermoplastic (90 mil)'!AZ10","v":83.427598060590171},{"$f":"'thermoplastic (90 mil)'!BA10","v":81.449986120291655},{"$f":"'thermoplastic (90 mil)'!BB10","v":79.472374179993153},{"$f":"'thermoplastic (90 mil)'!BC10","v":77.494762239694637},{"$f":"'thermoplastic (90 mil)'!BD10","v":75.517150299396135},{"$f":"'thermoplastic (90 mil)'!BE10","v":0}]
[null,null,"White Edge","90 mil",{"$f":"'thermoplastic (90 mil)'!CA10","v":2500000},{"$f":"'thermoplastic (90 mil)'!CB10","v":5000000},{"$f":"'thermoplastic (90 mil)'!CC10","v":7500000},{"$f":"'thermoplastic (90 mil)'!CD10","v":10000000},{"$f":"'thermoplastic (90 mil)'!CE10","v":12500000},{"$f":"'thermoplastic (90 mil)'!CF10","v":0},"90 mil",{"$f":"'thermoplastic (90 mil)'!AZ9","v":122.42969666752957},{"$f":"'thermoplastic (90 mil)'!BA9","v":100.92776629703135},{"$f":"'thermoplastic (90 mil)'!BB9","v":84.974721183435918},{"$f":"'thermoplastic (90 mil)'!BC9","v":72.66808638151943},{"$f":"'thermoplastic (90 mil)'!BD9","v":62.885889487688381},{"$f":"'thermoplastic (90 mil)'!BE9","v":0}]
[null,null,"White Lane","90 mil",{"$f":"'thermoplastic (90 mil)'!CA11","v":2500000},{"$f":"'thermoplastic (90 mil)'!CB11","v":5000000},{"$f":"'thermoplastic (90 mil)'!CC11","v":7500000},{"$f":"'thermoplastic (90 mil)'!CD11","v":10000000},{"$f":"'thermoplastic (90 mil)'!CE11","v":12500000},{"$f":"'thermoplastic (90 mil)'!CF11","v":0},"90 mil",{"$f":"'thermoplastic (90 mil)'!AZ9","v":122.42969666752957},{"$f":"'thermoplastic (90 mil)'!BA9","v":100.92776629703135},{"$f":"'thermoplastic (90 mil)'!BB9","v":84.974721183435918},{"$f":"'thermoplastic (90 mil)'!BC9","v":72.66808638151943},{"$f":"'thermoplastic (90 mil)'!BD9","v":62.885889487688381},{"$f":"'thermoplastic (90 mil)'!BE9","v":0}]
[null,"AC","Yellow Edge","90 mil",{"$f":"'thermoplastic (90 mil)'!CA12","v":2500000},{"$f":"'thermoplastic (90 mil)'!CB12","v":5000000},{"$f":"'thermoplastic (90 mil)'!CC12","v":7500000},{"$f":"'thermoplastic (90 mil)'!CD12","v":10000000},{"$f":"'thermoplastic (90 mil)'!CE12","v":12500000},{"$f":"'thermoplastic (90 mil)'!CF12","v":0},"90 mil",{"$f":"'thermoplastic (90 mil)'!AZ12","v":110.88452854653711},{"$f":"'thermoplastic (90 mil)'!BA12","v":103.52089218290075},{"$f":"'thermoplastic (90 mil)'!BB12","v":96.157255819264392},{"$f":"'thermoplastic (90 mil)'!BC12","v":88.793619455628004},{"$f":"'thermoplastic (90 mil)'!BD12","v":81.429983091991645},{"$f":"'thermoplastic (90 mil)'!BE12","v":0}]
[null,null,"White Edge","90 mil",{"$f":"'thermoplastic (90 mil)'!CA13","v":2500000},{"$f":"'thermoplastic (90 mil)'!CB13","v":5000000},{"$f":"'thermoplastic (90 mil)'!CC13","v":7500000},{"$f":"'thermoplastic (90 mil)'!CD13","v":10000000},{"$f":"'thermoplastic (90 mil)'!CE13","v":12500000},{"$f":"'thermoplastic (90 mil)'!CF13","v":0},"90 mil",{"$f":"'thermoplastic (90 mil)'!AZ11","v":116.0019359747992},{"$f":"'thermoplastic (90 mil)'!BA11","v":107.78765026051347},{"$f":"'thermoplastic (90 mil)'!BB11","v":99.573364546227779},{"$f":"'thermoplastic (90 mil)'!BC11","v":91.359078831942057},{"$f":"'thermoplastic (90 mil)'!BD11","v":83.144793117656349},{"$f":"'thermoplastic (90 mil)'!BE11","v":0}]
[null,null,"White Lane","90 mil",{"$f":"'thermoplastic (90 mil)'!CA14","v":2500000},{"$f":"'thermoplastic (90 mil)'!CB14","v":5000000},{"$f":"'thermoplastic (90 mil)'!CC14","v":7500000},{"$f":"'thermoplastic (90 mil)'!CD14","v":10000000},{"$f":"'thermoplastic (90 mil)'!CE14","v":12500000},{"$f":"'thermoplastic (90 mil)'!CF14","v":0},"90 mil",{"$f":"'thermoplastic (90 mil)'!AZ11","v":116.0019359747992},{"$f":"'thermoplastic (90 mil)'!BA11","v":107.78765026051347},{"$f":"'thermoplastic (90 mil)'!BB11","v":99.573364546227779},{"$f":"'thermoplastic (90 mil)'!BC11","v":91.359078831942057},{"$f":"'thermoplastic (90 mil)'!BD11","v":83.144793117656349},{"$f":"'thermoplastic (90 mil)'!BE11","v":0}]
["Tape","PCC","Yellow Edge","tape",{"$f":"tape!CA9","v":2500000},{"$f":"tape!CB9","v":5000000},{"$f":"tape!CC9","v":7500000},{"$f":"tape!CD9","v":10000000},{"$f":"tape!CE9","v":12500000},{"$f":"tape!CF9","v":0},"tape",{"$f":"tape!AZ10","v":96.772862447441909},{"$f":"tape!BA10","v":93.767543298505743},{"$f":"tape!BB10","v":90.762224149569576},{"$f":"tape!BC10","v":87.756905000633409},{"$f":"tape!BD10","v":84.751585851697243},{"$f":"tape!BE10","v":0}]
[null,null,"White Edge","tape",{"$f":"tape!CA10","v":2500000},{"$f":"tape!CB10","v":5000000},{"$f":"tape!CC10","v":7500000},{"$f":"tape!CD10","v":10000000},{"$f":"tape!CE10","v":12500000},{"$f":"tape!CF10","v":0},"tape",{"$f":"tape!AZ9","v":119.76222414956958},{"$f":"tape!BA9","v":116.7569050006334},{"$f":"tape!BB9","v":113.75158585169721},{"$f":"tape!BC9","v":110.74626670276106},{"$f":"tape!BD9","v":107.7409475538249},{"$f":"tape!BE9","v":0}]
[null,null,"White Lane","tape",{"$f":"tape!CA11","v":2500000},{"$f":"tape!CB11","v":5000000},{"$f":"tape!CC11","v":7500000},{"$f":"tape!CD11","v":10000000},{"$f":"tape!CE11","v":12500000},{"$f":"tape!CF11","v":0},"tape",{"$f":"tape!AZ9","v":119.76222414956958},{"$f":"tape!BA9","v":116.7569050006334},{"$f":"tape!BB9","v":113.75158585169721},{"$f":"tape!BC9","v":110.74626670276106},{"$f":"tape!BD9","v":107.7409475538249},{"$f":"tape!BE9","v":0}]
[null,"AC","Yellow Edge","tape",{"$f":"tape!CA12","v":2500000},{"$f":"tape!CB12","v":5000000},{"$f":"tape!CC12","v":7500000},{"$f":"tape!CD12","v":10000000},{"$f":"tape!CE12","v":12500000},{"$f":"tape!CF12","v":0},"tape",{"$f":"tape!AZ12","v":61.478791582655319},{"$f":"tape!BA12","v":54.216133354807219},{"$f":"tape!BB12","v":46.95347512695912},{"$f":"tape!BC12","v":39.690816899111013},{"$f":"tape!BD12","v":32.428158671262921},{"$f":"tape!BE12","v":0}]
[null,null,"White Edge","tape",{"$f":"tape!CA13","v":2500000},{"$f":"tape!CB13","v":5000000},{"$f":"tape!CC13","v":7500000},{"$f":"tape!CD13","v":10000000},{"$f":"tape!CE13","v":12500000},{"$f":"tape!CF13","v":0},"tape",{"$f":"tape!AZ11","v":75.111702975060382},{"$f":"tape!BA11","v":67.849044747212261},{"$f":"tape!BB11","v":60.586386519364169},{"$f":"tape!BC11","v":53.323728291516062},{"$f":"tape!BD11","v":46.06107006366797},{"$f":"tape!BE11","v":0}]
[null,null,"White Lane","tape",{"$f":"tape!CA14","v":2500000},{"$f":"tape!CB14","v":5000000},{"$f":"tape!CC14","v":7500000},{"$f":"tape!CD14","v":10000000},{"$f":"tape!CE14","v":12500000},{"$f":"tape!CF14","v":0},"tape",{"$f":"tape!AZ11","v":75.111702975060382},{"$f":"tape!BA11","v":67.849044747212261},{"$f":"tape!BB11","v":60.586386519364169},{"$f":"tape!BC11","v":53.323728291516062},{"$f":"tape!BD11","v":46.06107006366797},{"$f":"tape!BE11","v":0}]
["Inverted","PCC","Yellow Edge","inverted",{"$f":"inverted!CA9","v":2500000},{"$f":"inverted!CB9","v":5000000},{"$f":"inverted!CC9","v":7500000},{"$f":"inverted!CD9","v":10000000},{"$f":"inverted!CE9","v":12500000},{"$f":"inverted!CF9","v":0},"inverted",{"$f":"inverted!AZ10","v":58.657051639090845},{"$f":"inverted!BA10","v":58.657051639090845},{"$f":"inverted!BB10","v":58.657051639090845},{"$f":"inverted!BC10","v":58.657051639090845},{"$f":"inverted!BD10","v":58.657051639090845},{"$f":"inverted!BE10","v":0}]
[null,null,"White Edge","inverted",{"$f":"inverted!CA10","v":2500000},{"$f":"inverted!CB10","v":5000000},{"$f":"inverted!CC10","v":7500000},{"$f":"inverted!CD10","v":8104940.3426599838},{"$f":"inverted!CE10","v":5266744.0752656925},{"$f":"inverted!CF10","v":0},"inverted",{"$f":"inverted!AZ9","v":104.75424914820995},{"$f":"inverted!BA9","v":85.994559225729333},{"$f":"inverted!BB9","v":67.234869303248715},{"$f":"inverted!BC9","v":48.47517938076809},{"$f":"inverted!BD9","v":29.715489458287468},{"$f":"inverted!BE9","v":0}]
[null,null,"White Lane","inverted",{"$f":"inverted!CA11","v":2500000},{"$f":"inverted!CB11","v":5000000},{"$f":"inverted!CC11","v":7500000},{"$f":"inverted!CD11","v":8104940.3426599838},{"$f":"inverted!CE11","v":5266744.0752656925},{"$f":"inverted!CF11","v":0},"inverted",{"$f":"inverted!AZ9","v":104.75424914820995},{"$f":"inverted!BA9","v":85.994559225729333},{"$f":"inverted!BB9","v":67.234869303248715},{"$f":"inverted!BC9","v":48.47517938076809},{"$f":"inverted!BD9","v":29.715489458287468},{"$f":"inverted!BE9","v":0}]
[null,"AC","Yellow Edge","inverted",{"$f":"inverted!CA12","v":0},{"$f":"inverted!CB12","v":0},{"$f":"inverted!CC12","v":0},{"$f":"inverted!CD12","v":0},{"$f":"inverted!CE12","v":0},{"$f":"inverted!CF12","v":0},"inverted",{"$f":"inverted!AZ12","v":0},{"$f":"inverted!BA12","v":0},{"$f":"inverted!BB12","v":0},{"$f":"inverted!BC12","v":0},{"$f":"inverted!BD12","v":0},{"$f":"inverted!BE12","v":0}]
[null,null,"White Edge","inverted",{"$f":"inverted!CA13","v":0},{"$f":"inverted!CB13","v":0},{"$f":"inverted!CC13","v":0},{"$f":"inverted!CD13","v":0},{"$f":"inverted!CE13","v":0},{"$f":"inverted!CF13","v":0},"inverted",{"$f":"inverted!AZ11","v":0},{"$f":"inverted!BA11","v":0},{"$f":"inverted!BB11","v":0},{"$f":"inverted!BC11","v":0},{"$f":"inverted!BD11","v":0},{"$f":"inverted!BE11","v":0}]
[null,null,"White Lane","inverted",{"$f":"inverted!CA14","v":0},{"$f":"inverted!CB14","v":0},{"$f":"inverted!CC14","v":0},{"$f":"inverted!CD14","v":0},{"$f":"inverted!CE14","v":0},{"$f":"inverted!CF14","v":0},"inverted",{"$f":"inverted!AZ11","v":0},{"$f":"inverted!BA11","v":0},{"$f":"inverted!BB11","v":0},{"$f":"inverted!BC11","v":0},{"$f":"inverted!BD11","v":0},{"$f":"inverted!BE11","v":0}]
[]
[]
["PCC Utility",null,null,null,null,"AC Utility",null,null,null,null,null,"PCC PM Service Life",null,null,null,null,null,null,"AC PM Service Life"]

{"sheet":"tape","index":6,"n_rows":59,"n_cols":86,"rows_kept":59,"cut":false,"hidden":true,"merged":[[5,77,5,83],[6,78,6,83],[6,77,7,77],[0,0,13,0],[8,20,11,20],[8,21,9,21],[10,21,11,21],[8,61,13,61],[5,61,7,61],[4,47,4,50],[5,43,5,46],[5,47,5,50],[6,20,7,20],[6,21,7,21],[6,22,7,22],[6,27,6,31],[6,71,6,75],[6,43,6,44],[6,45,6,46],[6,47,6,48],[6,49,6,50],[5,62,7,62],[5,63,7,63],[5,71,5,75],[6,65,6,69],[5,65,5,69],[5,64,7,64],[5,51,5,56],[6,23,7,23],[8,62,10,62],[11,62,13,62],[14,62,16,62],[17,62,19,62],[6,24,7,24],[6,25,7,25],[6,26,7,26],[14,61,19,61],[6,32,6,37],[6,38,6,41],[6,42,7,42],[6,51,6,55]]}
["Input Values","Marking Material Type","Material","Tape"]
[null,"Marking Color","Color"]
[null,"Initial Retroreflectivity","R(initial)"]
[null,"Retroreflectivity Decay Rate","R(decay)"]
[null,"Minimum Effective Retroreflectivity (white)","R(min) (white)",{"$f":"Input!B10","v":100},null,null,null,null,null,null,null,null,null,null,null,null,null,null,null,null,null,null,null,null,null,null,null,null,null,null,null,null,null,null,null,null,null,null,null,null,null,null,null,null,null,null,null,"use this as criteria"]
[null,"Minimum Effective Retroreflectivity (yellow)","R(min) (yellow)",{"$f":"Input!B11","v":100},null,null,null,null,null,null,null,null,null,null,null,null,null,null,null,null,null,null,null,null,null,null,null,null,null,null,null,null,null,null,null,null,null,null,null,null,null,null,null,"Cost",null,null,null,"Life Time Utility/Cost",null,null,null,"Expected PM Life Time",null,null,null,null,null,null,null,null,null,"Application Type","Pavement Type","Line Type","utility /cost","Off-Peak Application",null,null,null,null,null,"Night Time Application",null,null,null,null,null,"Utility"]
[null,"Maximum Effectove Retroreflectivity","R(max)",{"$f":"Input!B12","v":200},null,null,null,null,null,null,null,null,null,null,null,null,null,null,null,null,"Material","Pavement","Color","Initial Retro","Month (R=min)","Month (R=max)","Retro [M(max)]","utility has 5 scenarios, now identify them",null,null,null,null,"Utility has 5 equations based on the values of M(s), M(max), ,M(min), and initial retro value",null,null,null,null,null,"Simplified Kansas Utility",null,null,null,"Over Estimate Utility","New Stripe",null,"Restripe",null,"New Stripe",null,"Restripe",null,"ADT Per Lane",null,null,null,null,"User Specify",null,null,null,null,null,null,null,null,"ADT Per Lane",null,null,null,null,"User Specify","ADT Per Lane",null,null,null,null,"User Specify","Utility","ADT Per Lane"]
[null,"Maximum Pavement Remaining Service Life in Month","M(max)",{"$f":"Input!B13","v":100},null,null,null,null,null,null,null,null,null,null,null,null,null,null,null,null,null,null,null,null,null,null,null," test cases 1, 2, 3","test cases 4, 5","for cases 1, 2, 3","for cases 4, 5","final case","case 1","case 2","case 3","case 4","case 5","final utililty","Average Retro","Average Useful Retro","Service Years","Utility",null,"Solid","Dash","Solid","Dash","Solid","Dash","Solid","Dash",5000,10000,15000,20000,25000,{"$f":"Input!B33","v":"No"},null,null,null,null,null,null,null,null,5000,10000,15000,20000,25000,{"$f":"Input!B33","v":"No"},5000,10000,15000,20000,25000,{"$f":"Input!B33","v":"No"},null,5000,10000,15000,20000,25000,{"$f":"Input!B33","v":"No"}]
[null,"ADT Per Lane","ADT","No","average costs","% less for off-peak","% more for night time",null,null,null,null,null,null,null,null,null,null,null,null,null,"Tape","PCC","White",{"$f":"EXP(6.9132)*EXP(-0.0113*D9/1000)","v":{"$error":"#VALUE!"}},{"$f":"(LN($D$5)-6.9132+0.0113*$D$9/1000)/(-0.0188)","v":{"$error":"#VALUE!"}},{"$f":"(LN($D$7)-6.9132+0.0113*$D$9/1000)/(-0.0188)","v":{"$error":"#VALUE!"}},{"$f":"EXP(6.9132-0.0113*$D$9/1000-0.0188*$D$8)","v":{"$error":"#VALUE!"}},{"$f":"IF(Z9>=0, \"cases 1, 2, 3\",\"\")","v":{"$error":"#VALUE!"}},{"$f":"IF(Z9<0, \"cases 4, 5\",\"\")","v":{"$error":"#VALUE!"}},{"$f":"IF(AB9=\"\",\"\",IF($D$8<=Z9,1,IF($D$8>=Y9,3,2)))","v":{"$error":"#VALUE!"}},{"$f":"IF(AC9=\"\",\"\",IF($D$8<Y9,4,5))","v":{"$error":"#VALUE!"}},{"$f":"IF(AD9<>\"\",AD9,AE9)","v":{"$error":"#VALUE!"}},{"$f":"IF(AF9=1,($D$7-$D$5)*$D$8*$D$9,\"\")","v":{"$error":"#VALUE!"}},{"$f":"IF(AF9=2,(($D$7-$D$5)*Z9+0.5*(AA9-$D$5+$D$7-$D$5)*($D$8-Z9))*$D$9,\"\")","v":{"$error":"#VALUE!"}},{"$f":"IF(AF9=3,(($D$7-$D$5)*Z9+0.5*($D$7-$D$5)*(Y9-Z9))*$D$9,\"\")","v":{"$error":"#VALUE!"}},{"$f":"IF(AF9=4,0.5*$D$8*(X9-$D$5+AA9-$D$5)*$D$9,\"\")","v":{"$error":"#VALUE!"}},{"$f":"IF(AF9=5,0.5*Y9*(X9-$D$5)*$D$9,\"\")","v":{"$error":"#VALUE!"}},{"$f":"IF(AG9<>\"\",AG9,IF(AH9<>\"\",AH9,IF(AI9<>\"\",AI9,IF(AJ9<>\"\",AJ9,IF(AK9<>\"\",AK9)))))","v":{"$error":"#VALUE!"}},{"$f":"($D$5+X9)/2","v":{"$error":"#VALUE!"}},{"$f":"AM9-$D$5","v":{"$error":"#VALUE!"}},{"$f":"MIN(Y9,$D$8)","v":{"$error":"#VALUE!"}},{"$f":"AN9*AO9*$D$9","v":{"$error":"#VALUE!"}},{"$f":"AP9/AL9","v":{"$error":"#VALUE!"}},{"$f":"($D$11+$D$10)","v":{"$error":"#VALUE!"}},{"$f":"($D$12+$D$10)","v":{"$error":"#VALUE!"}},{"$f":"($D$10+$D$11+$D$13)","v":{"$error":"#VALUE!"}},{"$f":"($D$10+$D$12+$D$14)","v":{"$error":"#VALUE!"}},{"$f":"$AL9/AR9","v":{"$error":"#VALUE!"}},{"$error":"#VALUE!"},{"$error":"#VALUE!"},{"$error":"#VALUE!"},119.76222414956958,116.7569050006334,113.75158585169721,110.74626670276106,107.7409475538249,null,null,null,null,null,"New Stripe","PCC","Yellow Edge",{"$f":"AV10","v":{"$error":"#VALUE!"}},359.07535434026425,712.28445353387792,782.50218929598645,517.38943972882851,194.33037126276548,null,267.53911528881173,533.95539849198178,799.25590341067016,1063.4476248854403,1262.5384230069697,null,{"$f":"AL10","v":{"$error":"#VALUE!"}},2500000,5000000,7500000,10000000,12500000]
[null,"User Cost/Mile Due to Application","User Cost","",null,{"$f":"Input!B23/100","v":0.15},{"$f":"Input!B24/100","v":0.15},null,null,null,null,null,null,null,null,null,null,null,null,null,null,null,"Yellow",{"$f":"EXP(6.481)*EXP(-0.0113*D9/1000)","v":{"$error":"#VALUE!"}},{"$f":"(LN($D$6)-6.481+0.0113*$D$9/1000)/(-0.0188)","v":{"$error":"#VALUE!"}},{"$f":"(LN($D$7)-6.481+0.0113*$D$9/1000)/(-0.0188)","v":{"$error":"#VALUE!"}},{"$f":"EXP(6.481-0.0113*$D$9/1000-0.0188*$D$8)","v":{"$error":"#VALUE!"}},{"$f":"IF(Z10>=0, \"cases 1, 2, 3\",\"\")","v":{"$error":"#VALUE!"}},{"$f":"IF(Z10<0, \"cases 4, 5\",\"\")","v":{"$error":"#VALUE!"}},{"$f":"IF(AB10=\"\",\"\",IF($D$8<=Z10,1,IF($D$8>=Y10,3,2)))","v":{"$error":"#VALUE!"}},{"$f":"IF(AC10=\"\",\"\",IF($D$8<Y10,4,5))","v":{"$error":"#VALUE!"}},{"$f":"IF(AD10<>\"\",AD10,AE10)","v":{"$error":"#VALUE!"}},{"$f":"IF(AF10=1,($D$7-$D$6)*$D$8*$D$9,\"\")","v":{"$error":"#VALUE!"}},{"$f":"IF(AF10=2,(($D$7-$D$6)*Z10+0.5*(AA10-$D$6+$D$7-$D$6)*($D$8-Z10))*$D$9,\"\")","v":{"$error":"#VALUE!"}},{"$f":"IF(AF10=3,(($D$7-$D$6)*Z10+0.5*($D$7-$D$6)*(Y10-Z10))*$D$9,\"\")","v":{"$error":"#VALUE!"}},{"$f":"IF(AF10=4,0.5*$D$8*(X10-$D$6+AA10-$D$6)*$D$9,\"\")","v":{"$error":"#VALUE!"}},{"$f":"IF(AF10=5,0.5*Y10*(X10-$D$6)*$D$9,\"\")","v":{"$error":"#VALUE!"}},{"$f":"IF(AG10<>\"\",AG10,IF(AH10<>\"\",AH10,IF(AI10<>\"\",AI10,IF(AJ10<>\"\",AJ10,IF(AK10<>\"\",AK10)))))","v":{"$error":"#VALUE!"}},{"$f":"($D$6+X10)/2","v":{"$error":"#VALUE!"}},{"$f":"AM10-$D$6","v":{"$error":"#VALUE!"}},{"$f":"MIN(Y10,$D$8)","v":{"$error":"#VALUE!"}},{"$f":"AN10*AO10*$D$9","v":{"$error":"#VALUE!"}},{"$f":"AP10/AL10","v":{"$error":"#VALUE!"}},{"$f":"($D$11+$D$10)","v":{"$error":"#VALUE!"}},{"$f":"($D$12+$D$10)","v":{"$error":"#VALUE!"}},{"$f":"($D$10+$D$11+$D$13)","v":{"$error":"#VALUE!"}},{"$f":"($D$10+$D$12+$D$14)","v":{"$error":"#VALUE!"}},{"$error":"#VALUE!"},{"$error":"#VALUE!"},{"$error":"#VALUE!"},{"$error":"#VALUE!"},96.772862447441909,93.767543298505743,90.762224149569576,87.756905000633409,84.751585851697243,null,null,null,null,null,null,null,"White Edge",{"$f":"AV9","v":{"$error":"#VALUE!"}},359.07535434026425,712.28445353387792,782.50218929598645,517.38943972882851,194.33037126276548,null,267.53911528881173,533.95539849198178,799.25590341067016,1063.4476248854403,1262.5384230069697,null,{"$f":"AL9","v":{"$error":"#VALUE!"}},2500000,5000000,7500000,10000000,12500000]
[null,"Application Cost/Mile (Solid)","Solid",9324.1999999999989,{"$f":"Input!B21","v":8108},{"$f":"(1-$F$10)*E11","v":6891.8},{"$f":"(1+$G$10)*E11","v":9324.1999999999989},null,null,null,null,null,null,null,null,null,null,null,null,null,null,"AC","White",{"$f":"EXP(7.2082)*EXP(-0.0459*D9/1000)","v":{"$error":"#VALUE!"}},{"$f":"(LN($D$5)-7.2082+0.0459*$D$9/1000)/(-0.0316)","v":{"$error":"#VALUE!"}},{"$f":"(LN($D$7)-7.2082+0.0459*$D$9/1000)/(-0.0316)","v":{"$error":"#VALUE!"}},{"$f":"EXP(7.2082-0.0459*$D$9/1000-0.0316*$D$8)","v":{"$error":"#VALUE!"}},{"$f":"IF(Z11>=0, \"cases 1, 2, 3\",\"\")","v":{"$error":"#VALUE!"}},{"$f":"IF(Z11<0, \"cases 4, 5\",\"\")","v":{"$error":"#VALUE!"}},{"$f":"IF(AB11=\"\",\"\",IF($D$8<=Z11,1,IF($D$8>=Y11,3,2)))","v":{"$error":"#VALUE!"}},{"$f":"IF(AC11=\"\",\"\",IF($D$8<Y11,4,5))","v":{"$error":"#VALUE!"}},{"$f":"IF(AD11<>\"\",AD11,AE11)","v":{"$error":"#VALUE!"}},{"$f":"IF(AF11=1,($D$7-$D$5)*$D$8*$D$9,\"\")","v":{"$error":"#VALUE!"}},{"$f":"IF(AF11=2,(($D$7-$D$5)*Z11+0.5*(AA11-$D$5+$D$7-$D$5)*($D$8-Z11))*$D$9,\"\")","v":{"$error":"#VALUE!"}},{"$f":"IF(AF11=3,(($D$7-$D$5)*Z11+0.5*($D$7-$D$5)*(Y11-Z11))*$D$9,\"\")","v":{"$error":"#VALUE!"}},{"$f":"IF(AF11=4,0.5*$D$8*(X11-$D$5+AA11-$D$5)*$D$9,\"\")","v":{"$error":"#VALUE!"}},{"$f":"IF(AF11=5,0.5*Y11*(X11-$D$5)*$D$9,\"\")","v":{"$error":"#VALUE!"}},{"$f":"IF(AG11<>\"\",AG11,IF(AH11<>\"\",AH11,IF(AI11<>\"\",AI11,IF(AJ11<>\"\",AJ11,IF(AK11<>\"\",AK11)))))","v":{"$error":"#VALUE!"}},{"$f":"($D$5+X11)/2","v":{"$error":"#VALUE!"}},{"$f":"AM11-$D$5","v":{"$error":"#VALUE!"}},{"$f":"MIN(Y11,$D$8)","v":{"$error":"#VALUE!"}},{"$f":"AN11*AO11*$D$9","v":{"$error":"#VALUE!"}},{"$f":"AP11/AL11","v":{"$error":"#VALUE!"}},{"$f":"($D$11+$D$10)","v":{"$error":"#VALUE!"}},{"$f":"($D$12+$D$10)","v":{"$error":"#VALUE!"}},{"$f":"($D$10+$D$11+$D$13)","v":{"$error":"#VALUE!"}},{"$f":"($D$10+$D$12+$D$14)","v":{"$error":"#VALUE!"}},{"$error":"#VALUE!"},{"$error":"#VALUE!"},{"$error":"#VALUE!"},{"$error":"#VALUE!"},75.111702975060382,67.849044747212261,60.586386519364169,53.323728291516062,46.06107006366797,null,null,null,null,null,null,null,"White Lane",{"$f":"AW9","v":{"$error":"#VALUE!"}},745.73953698249215,1466.3971605185407,1255.2957327135687,636.21929999024212,205.88501592907133,null,560.49061312740764,1116.0644531685964,1666.7859344601991,2212.7183510468817,2491.7082026772614,null,{"$f":"AL9","v":{"$error":"#VALUE!"}},2500000,5000000,7500000,10000000,12500000]
[null,"Application Cost/Mile (Dash)","Dash ",4440.1499999999996,{"$f":"Input!C21","v":3861},{"$f":"(1-$F$10)*E12","v":3281.85},{"$f":"(1+$G$10)*E12","v":4440.1499999999996},null,null,null,null,null,null,null,null,null,null,null,null,null,null,null,"Yellow",{"$f":"EXP(6.7774)*EXP(-0.0459*D9/1000)","v":{"$error":"#VALUE!"}},{"$f":"(LN($D$6)-6.7774+0.0459*$D$9/1000)/(-0.0316)","v":{"$error":"#VALUE!"}},{"$f":"(LN($D$7)-6.7774+0.0459*$D$9/1000)/(-0.0316)","v":{"$error":"#VALUE!"}},{"$f":"EXP(6.7774-0.0459*$D$9/1000-0.0316*$D$8)","v":{"$error":"#VALUE!"}},{"$f":"IF(Z12>=0, \"cases 1, 2, 3\",\"\")","v":{"$error":"#VALUE!"}},{"$f":"IF(Z12<0, \"cases 4, 5\",\"\")","v":{"$error":"#VALUE!"}},{"$f":"IF(AB12=\"\",\"\",IF($D$8<=Z12,1,IF($D$8>=Y12,3,2)))","v":{"$error":"#VALUE!"}},{"$f":"IF(AC12=\"\",\"\",IF($D$8<Y12,4,5))","v":{"$error":"#VALUE!"}},{"$f":"IF(AD12<>\"\",AD12,AE12)","v":{"$error":"#VALUE!"}},{"$f":"IF(AF12=1,($D$7-$D$6)*$D$8*$D$9,\"\")","v":{"$error":"#VALUE!"}},{"$f":"IF(AF12=2,(($D$7-$D$6)*Z12+0.5*(AA12-$D$6+$D$7-$D$6)*($D$8-Z12))*$D$9,\"\")","v":{"$error":"#VALUE!"}},{"$f":"IF(AF12=3,(($D$7-$D$6)*Z12+0.5*($D$7-$D$6)*(Y12-Z12))*$D$9,\"\")","v":{"$error":"#VALUE!"}},{"$f":"IF(AF12=4,0.5*$D$8*(X12-$D$6+AA12-$D$6)*$D$9,\"\")","v":{"$error":"#VALUE!"}},{"$f":"IF(AF12=5,0.5*Y12*(X12-$D$6)*$D$9,\"\")","v":{"$error":"#VALUE!"}},{"$f":"IF(AG12<>\"\",AG12,IF(AH12<>\"\",AH12,IF(AI12<>\"\",AI12,IF(AJ12<>\"\",AJ12,IF(AK12<>\"\",AK12)))))","v":{"$error":"#VALUE!"}},{"$f":"($D$6+X12)/2","v":{"$error":"#VALUE!"}},{"$f":"AM12-$D$6","v":{"$error":"#VALUE!"}},{"$f":"MIN(Y12,$D$8)","v":{"$error":"#VALUE!"}},{"$f":"AN12*AO12*$D$9","v":{"$error":"#VALUE!"}},{"$f":"AP12/AL12","v":{"$error":"#VALUE!"}},{"$f":"($D$11+$D$10)","v":{"$error":"#VALUE!"}},{"$f":"($D$12+$D$10)","v":{"$error":"#VALUE!"}},{"$f":"($D$10+$D$11+$D$13)","v":{"$error":"#VALUE!"}},{"$f":"($D$10+$D$12+$D$14)","v":{"$error":"#VALUE!"}},{"$error":"#VALUE!"},{"$error":"#VALUE!"},{"$error":"#VALUE!"},{"$error":"#VALUE!"},61.478791582655319,54.216133354807219,46.95347512695912,39.690816899111013,32.428158671262921,null,null,null,null,null,null,"AC","Yellow Edge",{"$f":"AV12","v":{"$error":"#VALUE!"}},359.07535434026425,712.28445353387792,782.50218929598645,517.38943972882851,194.33037126276548,null,267.53911528881173,533.95539849198178,799.25590341067016,1063.4476248854403,1262.5384230069697,null,{"$f":"AL12","v":{"$error":"#VALUE!"}},2500000,5000000,7500000,10000000,12500000]
[null,"Removal Cost/Mile (Solid)","Solid",6037.4999999999991,{"$f":"Input!D21","v":5250},{"$f":"(1-$F$10)*E13","v":4462.5},{"$f":"(1+$G$10)*E13","v":6037.4999999999991},null,null,null,null,null,null,null,null,null,null,null,null,null,null,null,null,null,null,null,null,null,null,null,null,null,null,null,null,null,null,null,null,null,null,null,null,null,null,null,null,null,null,null,null,null,null,null,null,null,null,null,null,null,null,null,null,"White Edge",{"$f":"AV11","v":{"$error":"#VALUE!"}},359.07535434026425,712.28445353387792,782.50218929598645,517.38943972882851,194.33037126276548,null,267.53911528881173,533.95539849198178,799.25590341067016,1063.4476248854403,1262.5384230069697,null,{"$f":"AL11","v":{"$error":"#VALUE!"}},2500000,5000000,7500000,10000000,12500000]
[null,"Removal Cost/Mile (Dash)","Dash ",6037.4999999999991,{"$f":"Input!E21","v":5250},{"$f":"(1-$F$10)*E14","v":4462.5},{"$f":"(1+$G$10)*E14","v":6037.4999999999991},null,null,null,null,null,null,null,null,null,null,null,null,null,null,null,null,null,null,null,null,null,null,null,null,null,null,null,null,null,null,null,null,null,null,null,null,null,null,null,null,null,null,null,null,null,null,null,null,null,null,null,null,null,null,null,null,"White Lane",{"$f":"AW11","v":{"$error":"#VALUE!"}},745.73953698249215,1466.3971605185407,1255.2957327135687,636.21929999024212,205.88501592907133,null,560.49061312740764,1116.0644531685964,1666.7859344601991,2212.7183510468817,2491.7082026772614,null,{"$f":"AL11","v":{"$error":"#VALUE!"}},2500000,5000000,7500000,10000000,12500000]
[null,null,null,null,null,null,null,null,null,null,null,null,null,null,null,null,null,null,null,null,null,null,null,null,null,null,null,null,null,null,null,null,null,null,null,null,null,null,null,null,null,null,null,null,null,null,null,null,null,null,null,null,null,null,null,null,null,null,null,null,null,"Restripe","PCC","Yellow Edge",{"$f":"AX10","v":{"$error":"#VALUE!"}},218.82169603615264,435.45785391722018,533.91659917924596,420.33936880775514,181.72315603158413,null,162.52839045924546,324.64205940456236,486.34259217229658,647.63156602882304,784.27983078318562,null,{"$f":"AL10","v":{"$error":"#VALUE!"}},2500000,5000000,7500000,10000000,12500000]
[null,null,null,null,null,null,null,null,null,null,null,null,null,null,null,null,null,null,null,null,null,null,null,null,null,null,null,null,null,null,null,null,null,null,null,null,null,null,null,null,null,null,null,null,null,null,null,null,null,null,null,null,null,null,null,null,null,null,null,null,null,null,null,"White Edge",{"$f":"AX9","v":{"$error":"#VALUE!"}},218.82169603615264,435.45785391722018,533.91659917924596,420.33936880775514,181.72315603158413,null,162.52839045924546,324.64205940456236,486.34259217229658,647.63156602882304,784.27983078318562,null,{"$f":"AL9","v":{"$error":"#VALUE!"}},2500000,5000000,7500000,10000000,12500000]
[null,null,null,null,null,null,null,null,null,null,null,null,null,null,null,null,null,null,null,null,null,null,null,null,null,null,null,null,null,null,null,null,null,null,null,null,null,null,null,null,null,null,null,null,null,null,null,null,null,null,null,null,null,null,null,null,null,null,null,null,null,null,null,"White Lane",{"$f":"AY9","v":{"$error":"#VALUE!"}},319.9026716335739,635.14505614990674,718.58437356428124,495.53152594143319,191.78838714336896,null,238.14336573543721,475.39688033157609,711.76552204015161,947.25423204773267,1130.7981786610078,null,{"$f":"AL9","v":{"$error":"#VALUE!"}},2500000,5000000,7500000,10000000,12500000]
[null,null,null,null,null,null,null,null,null,null,null,null,null,null,null,null,null,null,null,null,null,null,null,null,null,null,null,null,null,null,null,null,null,null,null,null,null,null,null,null,null,null,null,null,null,null,null,null,null,null,null,null,null,null,null,null,null,null,null,null,null,null,"AC","Yellow Edge",{"$f":"AX12","v":{"$error":"#VALUE!"}},218.82169603615264,435.45785391722018,533.91659917924596,420.33936880775514,181.72315603158413,null,162.52839045924546,324.64205940456236,486.34259217229658,647.63156602882304,784.27983078318562,null,{"$f":"AL12","v":{"$error":"#VALUE!"}},2500000,5000000,7500000,10000000,12500000]
[null,null,null,null,null,null,null,null,null,null,null,null,null,null,null,null,null,null,null,null,null,null,null,null,null,null,null,null,null,null,null,null,null,null,null,null,null,null,null,null,null,null,null,null,null,null,null,null,null,null,null,null,null,null,null,null,null,null,null,null,null,null,null,"White Edge",{"$f":"AX11","v":{"$error":"#VALUE!"}},218.82169603615264,435.45785391722018,533.91659917924596,420.33936880775514,181.72315603158413,null,162.52839045924546,324.64205940456236,486.34259217229658,647.63156602882304,784.27983078318562,null,{"$f":"AL11","v":{"$error":"#VALUE!"}},2500000,5000000,7500000,10000000,12500000]
[null,null,null,null,null,null,null,null,null,null,null,null,null,null,null,null,null,null,null,null,null,null,null,null,null,null,null,null,null,null,null,null,null,null,null,null,null,null,null,null,null,null,null,null,null,null,null,null,null,null,null,null,null,null,null,null,null,null,null,null,null,null,null,"White Lane",{"$f":"AY11","v":{"$error":"#VALUE!"}},319.9026716335739,635.14505614990674,718.58437356428124,495.53152594143319,191.78838714336896,null,238.14336573543721,475.39688033157609,711.76552204015161,947.25423204773267,1130.7981786610078,null,{"$f":"AL11","v":{"$error":"#VALUE!"}},2500000,5000000,7500000,10000000,12500000]
[]
[]
[]
[null,"1. no cost differences between PCC and AC?",null,"YES"]
[null,"2. no cost differences between yellow and white?"]
[null,"3. removal only incurred to PCC with center tape and thermo edge lines"]
[null,"however, in this calculation, we will apply to all PCC tape and thermo"]
[]
[]
[]
[null,null,null,null,"urban/rural off peak user costs"]
[null,null,"ADT/Lane",5000,10000,15000,20000,25000,{"$f":"Input!B33","v":"No"}]
[null,null,"User Cost",{"$f":"Input!C28","v":70.526903758950084},{"$f":"Input!C29","v":127.86745896720328},{"$f":"Input!C30","v":2692.8377206276123},{"$f":"Input!C31","v":12436.000747617014},{"$f":"Input!C32","v":57431.650414747659},{"$f":"Input!C33","v":""}]
[]
[]
[]
[null,null,null,null,"urban night user costs"]
[null,null,"ADT/Lane",5000,10000,15000,20000,25000,{"$f":"Input!B33","v":"No"}]
[null,null,"User Cost",{"$f":"Input!D28","v":20.227999999999998},{"$f":"Input!D29","v":39.878},{"$f":"Input!D30","v":59.528000000000006},{"$f":"Input!D31","v":79.177999999999997},{"$f":"Input!D32","v":576.48878080473003},{"$f":"Input!D33","v":""}]
[]
[]
[]
[]
[]
[]
[]
[]
[]
[]
[]
[]
[]
[]
[]
[]
[]
[]
[]
[null,null,null,null,null,null,null,null,null,null,null,null,null,null,null,null,null,null,null,null,null,null,null,null,null,null,null,null,null,null,null,null,null,null,null,null,null,null,null,null,null,null,null,null,null,null,null,null,null,null,null,null,null,null,null,null,null,null,null,null,null,null,null,null,null,null,null,null,null,null,null,null,null,null,null,null,null,null,null,null,null,null,null,null,null,"Calculating…Tape"]

{"sheet":"thermoplastic (90 mil)","index":7,"n_rows":59,"n_cols":86,"rows_kept":59,"cut":false,"hidden":true,"merged":[[5,77,5,83],[6,77,7,77],[6,78,6,83],[0,0,13,0],[8,61,13,61],[5,64,7,64],[5,65,5,69],[6,65,6,69],[5,71,5,75],[6,71,6,75],[5,63,7,63],[6,42,7,42],[5,61,7,61],[5,62,7,62],[6,45,6,46],[6,47,6,48],[8,20,11,20],[8,21,9,21],[10,21,11,21],[4,47,4,50],[5,47,5,50],[6,20,7,20],[6,21,7,21],[6,22,7,22],[6,23,7,23],[6,24,7,24],[6,25,7,25],[6,26,7,26],[6,27,6,31],[6,32,6,37],[6,38,6,41],[17,62,19,62],[6,43,6,44],[6,49,6,50],[5,43,5,46],[8,62,10,62],[11,62,13,62],[14,62,16,62],[14,61,19,61],[5,51,5,56],[6,51,6,55]]}
["Input Values","Marking Material Type","Material","Tape"]
[null,"Marking Color","Color"]
[null,"Initial Retroreflectivity","R(initial)"]
[null,"Retroreflectivity Decay Rate","R(decay)"]
[null,"Minimum Effective Retroreflectivity (white)","R(min) (white)",{"$f":"Input!B10","v":100},null,null,null,null,null,null,null,null,null,null,null,null,null,null,null,null,null,null,null,null,null,null,null,null,null,null,null,null,null,null,null,null,null,null,null,null,null,null,null,null,null,null,null,"use this as criteria"]
[null,"Minimum Effective Retroreflectivity (yellow)","R(min) (yellow)",{"$f":"Input!B11","v":100},null,null,null,null,null,null,null,null,null,null,null,null,null,null,null,null,null,null,null,null,null,null,null,null,null,null,null,null,null,null,null,null,null,null,null,null,null,null,null,"Cost",null,null,null,"Life Time Utility/Cost",null,null,null,"Expected PM Life Time",null,null,null,null,null,null,null,null,null,"Application Type","Pavement Type","Line Type","utility /cost","Off-Peak Application",null,null,null,null,null,"Night Time Application",null,null,null,null,null,"Utility"]
[null,"Maximum Effectove Retroreflectivity","R(max)",{"$f":"Input!B12","v":200},null,null,null,null,null,null,null,null,null,null,null,null,null,null,null,null,"Material","Pavement","Color","Initial Retro","Month (R=min)","Month (R=max)","Retro [M(max)]","utility has 5 scenarios, now identify them",null,null,null,null,"Utility has 5 equations based on the values of M(s), M(max), ,M(min), and initial retro value",null,null,null,null,null,"Simplified Kansas Utility",null,null,null,"Over Estimate Utility","New Stripe",null,"Restripe",null,"New Stripe",null,"Restripe",null,"ADT Per Lane",null,null,null,null,"User Specify",null,null,null,null,null,null,null,null,"ADT Per Lane",null,null,null,null,null,"ADT Per Lane",null,null,null,null,null,"Utility","ADT Per Lane"]
[null,"Maximum Pavement Remaining Service Life in Month","M(max)",{"$f":"Input!B13","v":100},null,null,null,null,null,null,null,null,null,null,null,null,null,null,null,null,null,null,null,null,null,null,null," test cases 1, 2, 3","test cases 4, 5","for cases 1, 2, 3","for cases 4, 5","final case","case 1","case 2","case 3","case 4","case 5","final utililty","Average Retro","Average Useful Retro","Service Years","Utility",null,"Solid","Dash","Solid","Dash","Solid","Dash","Solid","Dash",5000,10000,15000,20000,25000,{"$f":"Input!B33","v":"No"},null,null,null,null,null,null,null,null,5000,10000,15000,20000,25000,{"$f":"I32","v":"No"},5000,{"$f":"BO8","v":10000},{"$f":"BP8","v":15000},{"$f":"BQ8","v":20000},{"$f":"BR8","v":25000},{"$f":"I38","v":"No"},null,5000,10000,15000,20000,25000,{"$f":"Input!B33","v":"No"}]
[null,"ADT Per Lane","ADT","No","average costs","% less for off-peak","% more for night time",null,null,null,null,null,null,null,null,null,null,null,null,null,"Thermo (90 mil)","PCC","White",{"$f":"EXP(6.3492)*EXP(-0.0109*D9/1000)","v":{"$error":"#VALUE!"}},{"$f":"(LN($D$5)-6.3492+0.0109*$D$9/1000)/(-0.0114-0.016*30/1000000*$D$9)","v":{"$error":"#VALUE!"}},{"$f":"(LN($D$7)-6.3492+0.0109*$D$9/1000)/(-0.0114-0.016*30/1000000*$D$9)","v":{"$error":"#VALUE!"}},{"$f":"EXP(6.3492-0.0114*$D$8-0.016*30*$D$9*$D$8/1000000-0.0109*$D$9/1000)","v":{"$error":"#VALUE!"}},{"$f":"IF(Z9>=0, \"cases 1, 2, 3\",\"\")","v":{"$error":"#VALUE!"}},{"$f":"IF(Z9<0, \"cases 4, 5\",\"\")","v":{"$error":"#VALUE!"}},{"$f":"IF(AB9=\"\",\"\",IF($D$8<=Z9,1,IF($D$8>=Y9,3,2)))","v":{"$error":"#VALUE!"}},{"$f":"IF(AC9=\"\",\"\",IF($D$8<Y9,4,5))","v":{"$error":"#VALUE!"}},{"$f":"IF(AD9<>\"\",AD9,AE9)","v":{"$error":"#VALUE!"}},{"$f":"IF(AF9=1,($D$7-$D$5)*$D$8*$D$9,\"\")","v":{"$error":"#VALUE!"}},{"$f":"IF(AF9=2,(($D$7-$D$5)*Z9+0.5*(AA9-$D$5+$D$7-$D$5)*($D$8-Z9))*$D$9,\"\")","v":{"$error":"#VALUE!"}},{"$f":"IF(AF9=3,(($D$7-$D$5)*Z9+0.5*($D$7-$D$5)*(Y9-Z9))*$D$9,\"\")","v":{"$error":"#VALUE!"}},{"$f":"IF(AF9=4,0.5*$D$8*(X9-$D$5+AA9-$D$5)*$D$9,\"\")","v":{"$error":"#VALUE!"}},{"$f":"IF(AF9=5,0.5*Y9*(X9-$D$5)*$D$9,\"\")","v":{"$error":"#VALUE!"}},{"$f":"IF(AG9<>\"\",AG9,IF(AH9<>\"\",AH9,IF(AI9<>\"\",AI9,IF(AJ9<>\"\",AJ9,IF(AK9<>\"\",AK9)))))","v":{"$error":"#VALUE!"}},{"$f":"($D$5+X9)/2","v":{"$error":"#VALUE!"}},{"$f":"AM9-$D$5","v":{"$error":"#VALUE!"}},{"$f":"MIN(Y9,$D$8)","v":{"$error":"#VALUE!"}},{"$f":"AN9*AO9*$D$9","v":{"$error":"#VALUE!"}},{"$f":"AP9/AL9","v":{"$error":"#VALUE!"}},{"$f":"($D$11+$D$10)","v":{"$error":"#VALUE!"}},{"$f":"($D$12+$D$10)","v":{"$error":"#VALUE!"}},{"$f":"($D$10+$D$11+$D$13)","v":{"$error":"#VALUE!"}},{"$f":"($D$10+$D$12+$D$14)","v":{"$error":"#VALUE!"}},{"$f":"$AL9/AR9","v":{"$error":"#VALUE!"}},{"$error":"#VALUE!"},{"$error":"#VALUE!"},{"$error":"#VALUE!"},122.42969666752957,100.92776629703135,84.974721183435918,72.66808638151943,62.885889487688381,null,null,null,null,null,"New Stripe","PCC","Yellow Edge",{"$f":"AV10","v":{"$error":"#VALUE!"}},1157.5001661702681,2255.1296158428609,1568.3362625984125,688.45390355449797,210.01008742129969,null,878.13952442773405,1744.2399962603495,2598.547308112873,3441.3007015435614,3673.0257429457693,null,{"$f":"AL10","v":{"$error":"#VALUE!"}},2500000,5000000,7500000,10000000,12500000]
[null,"User Cost/Mile Due to Application","User Cost","",null,{"$f":"Input!B23/100","v":0.15},{"$f":"Input!B24/100","v":0.15},null,null,null,null,null,null,null,null,null,null,null,null,null,null,null,"Yellow",{"$f":"EXP(5.7496)*EXP(-0.0053*D9/1000)","v":{"$error":"#VALUE!"}},{"$f":"(LN($D$6)-5.7496+0.0053*$D$9/1000)/(-0.0134)","v":{"$error":"#VALUE!"}},{"$f":"(LN($D$7)-5.7496+0.0053*$D$9/1000)/(-0.0134)","v":{"$error":"#VALUE!"}},{"$f":"EXP(5.7496-0.0053*$D$9/1000-0.0134*$D$8)","v":{"$error":"#VALUE!"}},{"$f":"IF(Z10>=0, \"cases 1, 2, 3\",\"\")","v":{"$error":"#VALUE!"}},{"$f":"IF(Z10<0, \"cases 4, 5\",\"\")","v":{"$error":"#VALUE!"}},{"$f":"IF(AB10=\"\",\"\",IF($D$8<=Z10,1,IF($D$8>=Y10,3,2)))","v":{"$error":"#VALUE!"}},{"$f":"IF(AC10=\"\",\"\",IF($D$8<Y10,4,5))","v":{"$error":"#VALUE!"}},{"$f":"IF(AD10<>\"\",AD10,AE10)","v":{"$error":"#VALUE!"}},{"$f":"IF(AF10=1,($D$7-$D$6)*$D$8*$D$9,\"\")","v":{"$error":"#VALUE!"}},{"$f":"IF(AF10=2,(($D$7-$D$6)*Z10+0.5*(AA10-$D$6+$D$7-$D$6)*($D$8-Z10))*$D$9,\"\")","v":{"$error":"#VALUE!"}},{"$f":"IF(AF10=3,(($D$7-$D$6)*Z10+0.5*($D$7-$D$6)*(Y10-Z10))*$D$9,\"\")","v":{"$error":"#VALUE!"}},{"$f":"IF(AF10=4,0.5*$D$8*(X10-$D$6+AA10-$D$6)*$D$9,\"\")","v":{"$error":"#VALUE!"}},{"$f":"IF(AF10=5,0.5*Y10*(X10-$D$6)*$D$9,\"\")","v":{"$error":"#VALUE!"}},{"$f":"IF(AG10<>\"\",AG10,IF(AH10<>\"\",AH10,IF(AI10<>\"\",AI10,IF(AJ10<>\"\",AJ10,IF(AK10<>\"\",AK10)))))","v":{"$error":"#VALUE!"}},{"$f":"($D$6+X10)/2","v":{"$error":"#VALUE!"}},{"$f":"AM10-$D$6","v":{"$error":"#VALUE!"}},{"$f":"MIN(Y10,$D$8)","v":{"$error":"#VALUE!"}},{"$f":"AN10*AO10*$D$9","v":{"$error":"#VALUE!"}},{"$f":"AP10/AL10","v":{"$error":"#VALUE!"}},{"$f":"($D$11+$D$10)","v":{"$error":"#VALUE!"}},{"$f":"($D$12+$D$10)","v":{"$error":"#VALUE!"}},{"$f":"($D$10+$D$11+$D$13)","v":{"$error":"#VALUE!"}},{"$f":"($D$10+$D$12+$D$14)","v":{"$error":"#VALUE!"}},{"$error":"#VALUE!"},{"$error":"#VALUE!"},{"$error":"#VALUE!"},{"$error":"#VALUE!"},83.427598060590171,81.449986120291655,79.472374179993153,77.494762239694637,75.517150299396135,null,null,null,null,null,null,null,"White Edge",{"$f":"AV9","v":{"$error":"#VALUE!"}},1157.5001661702681,2255.1296158428609,1568.3362625984125,688.45390355449797,210.01008742129969,null,878.13952442773405,1744.2399962603495,2598.547308112873,3441.3007015435614,3673.0257429457693,null,{"$f":"AL9","v":{"$error":"#VALUE!"}},2500000,5000000,7500000,10000000,12500000]
[null,"Application Cost/Mile (Solid)","Solid",2826.7,{"$f":"Input!B20","v":2458},{"$f":"(1-$F$10)*E11","v":2089.2999999999997},{"$f":"(1+$G$10)*E11","v":2826.7},null,null,null,null,null,null,null,null,null,null,null,null,null,null,"AC","White",{"$f":"EXP(6.5181)*EXP(-0.0253*D9/1000)","v":{"$error":"#VALUE!"}},{"$f":"(LN($D$5)-6.5181+0.0253*$D$9/1000)/(-0.0154)","v":{"$error":"#VALUE!"}},{"$f":"(LN($D$7)-6.5181+0.0253*$D$9/1000)/(-0.0154)","v":{"$error":"#VALUE!"}},{"$f":"EXP(6.5181-0.0253*$D$9/1000-0.0154*$D$8)","v":{"$error":"#VALUE!"}},{"$f":"IF(Z11>=0, \"cases 1, 2, 3\",\"\")","v":{"$error":"#VALUE!"}},{"$f":"IF(Z11<0, \"cases 4, 5\",\"\")","v":{"$error":"#VALUE!"}},{"$f":"IF(AB11=\"\",\"\",IF($D$8<=Z11,1,IF($D$8>=Y11,3,2)))","v":{"$error":"#VALUE!"}},{"$f":"IF(AC11=\"\",\"\",IF($D$8<Y11,4,5))","v":{"$error":"#VALUE!"}},{"$f":"IF(AD11<>\"\",AD11,AE11)","v":{"$error":"#VALUE!"}},{"$f":"IF(AF11=1,($D$7-$D$5)*$D$8*$D$9,\"\")","v":{"$error":"#VALUE!"}},{"$f":"IF(AF11=2,(($D$7-$D$5)*Z11+0.5*(AA11-$D$5+$D$7-$D$5)*($D$8-Z11))*$D$9,\"\")","v":{"$error":"#VALUE!"}},{"$f":"IF(AF11=3,(($D$7-$D$5)*Z11+0.5*($D$7-$D$5)*(Y11-Z11))*$D$9,\"\")","v":{"$error":"#VALUE!"}},{"$f":"IF(AF11=4,0.5*$D$8*(X11-$D$5+AA11-$D$5)*$D$9,\"\")","v":{"$error":"#VALUE!"}},{"$f":"IF(AF11=5,0.5*Y11*(X11-$D$5)*$D$9,\"\")","v":{"$error":"#VALUE!"}},{"$f":"IF(AG11<>\"\",AG11,IF(AH11<>\"\",AH11,IF(AI11<>\"\",AI11,IF(AJ11<>\"\",AJ11,IF(AK11<>\"\",AK11)))))","v":{"$error":"#VALUE!"}},{"$f":"($D$5+X11)/2","v":{"$error":"#VALUE!"}},{"$f":"AM11-$D$5","v":{"$error":"#VALUE!"}},{"$f":"MIN(Y11,$D$8)","v":{"$error":"#VALUE!"}},{"$f":"AN11*AO11*$D$9","v":{"$error":"#VALUE!"}},{"$f":"AP11/AL11","v":{"$error":"#VALUE!"}},{"$f":"($D$11+$D$10)","v":{"$error":"#VALUE!"}},{"$f":"($D$12+$D$10)","v":{"$error":"#VALUE!"}},{"$f":"($D$10+$D$11+$D$13)","v":{"$error":"#VALUE!"}},{"$f":"($D$10+$D$12+$D$14)","v":{"$error":"#VALUE!"}},{"$error":"#VALUE!"},{"$error":"#VALUE!"},{"$error":"#VALUE!"},{"$error":"#VALUE!"},116.0019359747992,107.78765026051347,99.573364546227779,91.359078831942057,83.144793117656349,null,null,null,null,null,null,null,"White Lane",{"$f":"AW9","v":{"$error":"#VALUE!"}},3268.0725231251804,6080.3768003172318,2214.1608917149697,761.58847797474539,215.04969214877042,null,2604.769019502427,5105.0204813421715,7506.9213815137555,9816.1629011865789,8245.1716659681115,null,{"$f":"AL9","v":{"$error":"#VALUE!"}},2500000,5000000,7500000,10000000,12500000]
[null,"Application Cost/Mile (Dash)","Dash ",939.55,{"$f":"Input!C20","v":817},{"$f":"(1-$F$10)*E12","v":694.44999999999993},{"$f":"(1+$G$10)*E12","v":939.55},null,null,null,null,null,null,null,null,null,null,null,null,null,null,null,"Yellow",{"$f":"EXP(5.9059)*EXP(-0.0162*D9/1000)","v":{"$error":"#VALUE!"}},{"$f":"(LN($D$6)-5.9059+0.0162*$D$9/1000)/(-0.011)","v":{"$error":"#VALUE!"}},{"$f":"(LN($D$7)-5.9059+0.0162*$D$9/1000)/(-0.011)","v":{"$error":"#VALUE!"}},{"$f":"EXP(5.9059-0.0162*$D$9/1000-0.011*$D$8)","v":{"$error":"#VALUE!"}},{"$f":"IF(Z12>=0, \"cases 1, 2, 3\",\"\")","v":{"$error":"#VALUE!"}},{"$f":"IF(Z12<0, \"cases 4, 5\",\"\")","v":{"$error":"#VALUE!"}},{"$f":"IF(AB12=\"\",\"\",IF($D$8<=Z12,1,IF($D$8>=Y12,3,2)))","v":{"$error":"#VALUE!"}},{"$f":"IF(AC12=\"\",\"\",IF($D$8<Y12,4,5))","v":{"$error":"#VALUE!"}},{"$f":"IF(AD12<>\"\",AD12,AE12)","v":{"$error":"#VALUE!"}},{"$f":"IF(AF12=1,($D$7-$D$6)*$D$8*$D$9,\"\")","v":{"$error":"#VALUE!"}},{"$f":"IF(AF12=2,(($D$7-$D$6)*Z12+0.5*(AA12-$D$6+$D$7-$D$6)*($D$8-Z12))*$D$9,\"\")","v":{"$error":"#VALUE!"}},{"$f":"IF(AF12=3,(($D$7-$D$6)*Z12+0.5*($D$7-$D$6)*(Y12-Z12))*$D$9,\"\")","v":{"$error":"#VALUE!"}},{"$f":"IF(AF12=4,0.5*$D$8*(X12-$D$6+AA12-$D$6)*$D$9,\"\")","v":{"$error":"#VALUE!"}},{"$f":"IF(AF12=5,0.5*Y12*(X12-$D$6)*$D$9,\"\")","v":{"$error":"#VALUE!"}},{"$f":"IF(AG12<>\"\",AG12,IF(AH12<>\"\",AH12,IF(AI12<>\"\",AI12,IF(AJ12<>\"\",AJ12,IF(AK12<>\"\",AK12)))))","v":{"$error":"#VALUE!"}},{"$f":"($D$6+X12)/2","v":{"$error":"#VALUE!"}},{"$f":"AM12-$D$6","v":{"$error":"#VALUE!"}},{"$f":"MIN(Y12,$D$8)","v":{"$error":"#VALUE!"}},{"$f":"AN12*AO12*$D$9","v":{"$error":"#VALUE!"}},{"$f":"AP12/AL12","v":{"$error":"#VALUE!"}},{"$f":"($D$11+$D$10)","v":{"$error":"#VALUE!"}},{"$f":"($D$12+$D$10)","v":{"$error":"#VALUE!"}},{"$f":"($D$10+$D$11+$D$13)","v":{"$error":"#VALUE!"}},{"$f":"($D$10+$D$12+$D$14)","v":{"$error":"#VALUE!"}},{"$error":"#VALUE!"},{"$error":"#VALUE!"},{"$error":"#VALUE!"},{"$error":"#VALUE!"},110.88452854653711,103.52089218290075,96.157255819264392,88.793619455628004,81.429983091991645,null,null,null,null,null,null,"AC","Yellow Edge",{"$f":"AV12","v":{"$error":"#VALUE!"}},1157.5001661702681,2255.1296158428609,1568.3362625984125,688.45390355449797,210.01008742129969,null,878.13952442773405,1744.2399962603495,2598.547308112873,3441.3007015435614,3673.0257429457693,null,{"$f":"AL12","v":{"$error":"#VALUE!"}},2500000,5000000,7500000,10000000,12500000]
[null,"Removal Cost/Mile (Dolid)","Removal",6037.4999999999991,{"$f":"Input!D20","v":5250},{"$f":"(1-$F$10)*E13","v":4462.5},{"$f":"(1+$G$10)*E13","v":6037.4999999999991},null,null,null,null,null,null,null,null,null,null,null,null,null,null,null,null,null,null,null,null,null,null,null,null,null,null,null,null,null,null,null,null,null,null,null,null,null,null,null,null,null,null,null,null,null,null,null,null,null,null,null,null,null,null,null,null,"White Edge",{"$f":"AV11","v":{"$error":"#VALUE!"}},1157.5001661702681,2255.1296158428609,1568.3362625984125,688.45390355449797,210.01008742129969,null,878.13952442773405,1744.2399962603495,2598.547308112873,3441.3007015435614,3673.0257429457693,null,{"$f":"AL11","v":{"$error":"#VALUE!"}},2500000,5000000,7500000,10000000,12500000]
[null,"Removal Cost/Mile (Dash)","Dash ",6037.4999999999991,{"$f":"Input!E20","v":5250},{"$f":"(1-$F$10)*E14","v":4462.5},{"$f":"(1+$G$10)*E14","v":6037.4999999999991},null,null,null,null,null,null,null,null,null,null,null,null,null,null,null,null,null,null,null,null,null,null,null,null,null,null,null,null,null,null,null,null,null,null,null,null,null,null,null,null,null,null,null,null,null,null,null,null,null,null,null,null,null,null,null,null,"White Lane",{"$f":"AW11","v":{"$error":"#VALUE!"}},3268.0725231251804,6080.3768003172318,2214.1608917149697,761.58847797474539,215.04969214877042,null,2604.769019502427,5105.0204813421715,7506.9213815137555,9816.1629011865789,8245.1716659681115,null,{"$f":"AL11","v":{"$error":"#VALUE!"}},2500000,5000000,7500000,10000000,12500000]
[null,null,null,null,null,null,null,null,null,null,null,null,null,null,null,null,null,null,null,null,null,null,null,null,null,null,null,null,null,null,null,null,null,null,null,null,null,null,null,null,null,null,null,null,null,null,null,null,null,null,null,null,null,null,null,null,null,null,null,null,null,"Restripe","PCC","Yellow Edge",{"$f":"AX10","v":{"$error":"#VALUE!"}},377.5108109780802,748.54025753747476,811.28111524210499,526.65393601494418,195.36301838949987,null,281.39121618184083,561.54045371120969,840.45591707860217,1118.1457386683198,1324.0559338652931,null,{"$f":"AL10","v":{"$error":"#VALUE!"}},2500000,5000000,7500000,10000000,12500000]
[null,null,null,null,null,null,null,null,null,null,null,null,null,null,null,null,null,null,null,null,null,null,null,null,null,null,null,null,null,null,null,null,null,null,null,null,null,null,null,null,null,null,null,null,null,null,null,null,null,null,null,null,null,null,null,null,null,null,null,null,null,null,null,"White Edge",{"$f":"AX9","v":{"$error":"#VALUE!"}},377.5108109780802,748.54025753747476,811.28111524210499,526.65393601494418,195.36301838949987,null,281.39121618184083,561.54045371120969,840.45591707860217,1118.1457386683198,1324.0559338652931,null,{"$f":"AL9","v":{"$error":"#VALUE!"}},2500000,5000000,7500000,10000000,12500000]
[null,null,null,null,null,null,null,null,null,null,null,null,null,null,null,null,null,null,null,null,null,null,null,null,null,null,null,null,null,null,null,null,null,null,null,null,null,null,null,null,null,null,null,null,null,null,null,null,null,null,null,null,null,null,null,null,null,null,null,null,null,null,null,"White Lane",{"$f":"AY9","v":{"$error":"#VALUE!"}},478.24218949725275,946.10647176016846,955.43984970339488,568.40948078903205,199.71688002556203,null,357.28178871841311,712.56253448802681,1065.859001349804,1417.1877666084488,1654.8534882438628,null,{"$f":"AL9","v":{"$error":"#VALUE!"}},2500000,5000000,7500000,10000000,12500000]
[null,null,null,null,null,null,null,null,null,null,null,null,null,null,null,null,null,null,null,null,null,null,null,null,null,null,null,null,null,null,null,null,null,null,null,null,null,null,null,null,null,null,null,null,null,null,null,null,null,null,null,null,null,null,null,null,null,null,null,null,null,null,"AC","Yellow Edge",{"$f":"AX12","v":{"$error":"#VALUE!"}},377.5108109780802,748.54025753747476,811.28111524210499,526.65393601494418,195.36301838949987,null,281.39121618184083,561.54045371120969,840.45591707860217,1118.1457386683198,1324.0559338652931,null,{"$f":"AL12","v":{"$error":"#VALUE!"}},2500000,5000000,7500000,10000000,12500000]
[null,null,null,null,null,null,null,null,null,null,null,null,null,null,null,null,null,null,null,null,null,null,null,null,null,null,null,null,null,null,null,null,null,null,null,null,null,null,null,null,null,null,null,null,null,null,null,null,null,null,null,null,null,null,null,null,null,null,null,null,null,null,null,"White Edge",{"$f":"AX11","v":{"$error":"#VALUE!"}},377.5108109780802,748.54025753747476,811.28111524210499,526.65393601494418,195.36301838949987,null,281.39121618184083,561.54045371120969,840.45591707860217,1118.1457386683198,1324.0559338652931,null,{"$f":"AL11","v":{"$error":"#VALUE!"}},2500000,5000000,7500000,10000000,12500000]
[null,null,null,null,null,null,null,null,null,null,null,null,null,null,null,null,null,null,null,null,null,null,null,null,null,null,null,null,null,null,null,null,null,null,null,null,null,null,null,null,null,null,null,null,null,null,null,null,null,null,null,null,null,null,null,null,null,null,null,null,null,null,null,"White Lane",{"$f":"AY11","v":{"$error":"#VALUE!"}},478.24218949725275,946.10647176016846,955.43984970339488,568.40948078903205,199.71688002556203,null,357.28178871841311,712.56253448802681,1065.859001349804,1417.1877666084488,1654.8534882438628,null,{"$f":"AL11","v":{"$error":"#VALUE!"}},2500000,5000000,7500000,10000000,12500000]
[]
[]
[]
[]
[]
[]
[]
[]
[]
[]
[null,null,null,null,"urban/rural off peak user costs"]
[null,null,"ADT/Lane",5000,10000,15000,20000,25000,{"$f":"Input!B33","v":"No"}]
[null,null,"User Cost",{"$f":"Input!C28","v":70.526903758950084},{"$f":"Input!C29","v":127.86745896720328},{"$f":"Input!C30","v":2692.8377206276123},{"$f":"Input!C31","v":12436.000747617014},{"$f":"Input!C32","v":57431.650414747659},{"$f":"Input!C33","v":""}]
[]
[]
[]
[null,null,null,null,"urban night user costs"]
[null,null,"ADT/Lane",5000,10000,15000,20000,25000,{"$f":"Input!B33","v":"No"}]
[null,null,"User Cost",{"$f":"Input!D28","v":20.227999999999998},{"$f":"Input!D29","v":39.878},{"$f":"Input!D30","v":59.528000000000006},{"$f":"Input!D31","v":79.177999999999997},{"$f":"Input!D32","v":576.48878080473003},{"$f":"Input!D33","v":""}]
[]
[]
[]
[]
[]
[]
[]
[]
[]
[]
[]
[]
[]
[]
[]
[]
[]
[]
[]
[null,null,null,null,null,null,null,null,null,null,null,null,null,null,null,null,null,null,null,null,null,null,null,null,null,null,null,null,null,null,null,null,null,null,null,null,null,null,null,null,null,null,null,null,null,null,null,null,null,null,null,null,null,null,null,null,null,null,null,null,null,null,null,null,null,null,null,null,null,null,null,null,null,null,null,null,null,null,null,null,null,null,null,null,null,"Calculating…Thermo 90"]

{"sheet":"thermoplastic (40 mil)","index":8,"n_rows":59,"n_cols":86,"rows_kept":59,"cut":false,"hidden":true,"merged":[[5,77,5,83],[6,77,7,77],[6,78,6,83],[6,24,7,24],[6,25,7,25],[6,32,6,37],[6,38,6,41],[6,42,7,42],[5,61,7,61],[6,27,6,31],[5,71,5,75],[6,71,6,75],[5,51,5,56],[6,51,6,55],[14,61,19,61],[8,20,11,20],[8,21,9,21],[8,61,13,61],[10,21,11,21],[17,62,19,62],[5,65,5,69],[6,65,6,69],[0,0,13,0],[4,47,4,50],[5,43,5,46],[5,47,5,50],[6,43,6,44],[6,45,6,46],[6,47,6,48],[6,49,6,50],[6,26,7,26],[6,20,7,20],[6,21,7,21],[6,22,7,22],[6,23,7,23],[8,62,10,62],[11,62,13,62],[14,62,16,62],[5,63,7,63],[5,64,7,64],[5,62,7,62]]}
["Input Values","Marking Material Type","Material","Tape"]
[null,"Marking Color","Color"]
[null,"Initial Retroreflectivity","R(initial)"]
[null,"Retroreflectivity Decay Rate","R(decay)",null,null,null,null,null,null,null,null,null,null,null,null,null,null,null,null,null,null,null,null,null,null,null,null,null,null,null,null,null,null,null,null,null,null,null,null,null,null,null,null,null,null,null,null,null,null,null,null,null,null,null,null,null,null,null,null,null,null,null,null,null,null,null,null,null,null,null,"we can assume a 10 or 20% increase in application/removal cost?"]
[null,"Minimum Effective Retroreflectivity (white)","R(min) (white)",{"$f":"Input!B10","v":100},null,null,null,null,null,null,null,null,null,null,null,null,null,null,null,null,null,null,null,null,null,null,null,null,null,null,null,null,null,null,null,null,null,null,null,null,null,null,null,null,null,null,null,"use this as criteria"]
[null,"Minimum Effective Retroreflectivity (yellow)","R(min) (yellow)",{"$f":"Input!B11","v":100},null,null,null,null,null,null,null,null,null,null,null,null,null,null,null,null,null,null,null,null,null,null,null,null,null,null,null,null,null,null,null,null,null,null,null,null,null,null,null,"Cost",null,null,null,"Life Time Utility/Cost",null,null,null,"Expected PM Life Time",null,null,null,null,null,null,null,null,null,"Application Type","Pavement Type","Line Type","utility /cost","Off-Peak Application",null,null,null,null,null,"Night Time Application",null,null,null,null,null,"Utility"]
[null,"Maximum Effectove Retroreflectivity","R(max)",{"$f":"Input!B12","v":200},null,null,null,null,null,null,null,null,null,null,null,null,null,null,null,null,"Material","Pavement","Color","Initial Retro","Month (R=min)","Month (R=max)","Retro [M(max)]","utility has 5 scenarios, now identify them",null,null,null,null,"Utility has 5 equations based on the values of M(s), M(max), ,M(min), and initial retro value",null,null,null,null,null,"Simplified Kansas Utility",null,null,null,"Over Estimate Utility","New Stripe",null,"Restripe",null,"New Stripe",null,"Restripe",null,"ADT Per Lane",null,null,null,null,"User Specify",null,null,null,null,null,null,null,null,"ADT Per Lane",null,null,null,null,null,"ADT Per Lane",null,null,null,null,null,"Utility","ADT Per Lane"]
[null,"Maximum Pavement Remaining Service Life in Month","M(max)",{"$f":"Input!B13","v":100},null,null,null,null,null,null,null,null,null,null,null,null,null,null,null,null,null,null,null,null,null,null,null," test cases 1, 2, 3","test cases 4, 5","for cases 1, 2, 3","for cases 4, 5","final case","case 1","case 2","case 3","case 4","case 5","final utililty","Average Retro","Average Useful Retro","Service Years","Utility",null,"Solid","Dash","Solid","Dash","Solid","Dash","Solid","Dash",5000,10000,15000,20000,25000,{"$f":"Input!B33","v":"No"},null,null,null,null,null,null,null,null,5000,10000,15000,20000,25000,{"$f":"Input!B33","v":"No"},5000,{"$f":"BO8","v":10000},{"$f":"BP8","v":15000},{"$f":"BQ8","v":20000},{"$f":"BR8","v":25000},{"$f":"Input!B33","v":"No"},null,5000,10000,15000,20000,25000,{"$f":"Input!B33","v":"No"}]
[null,"ADT Per Lane","ADT","No","average costs","% less for off-peak","% more for night time",null,null,null,null,null,null,null,null,null,null,null,null,null,"Thermo (40 mil)","PCC","White",{"$f":"EXP(5.825)","v":338.66113307792727},{"$f":"(LN($D$5)-5.825)/(-0.0079-0.0559*30/1000000*$D$9)","v":{"$error":"#VALUE!"}},{"$f":"(LN($D$7)-5.825)/(-0.0079-0.0559*30/1000000*$D$9)","v":{"$error":"#VALUE!"}},{"$f":"EXP(5.825-0.0079*$D$8-0.0559*30*$D$8*$D$9/1000000)","v":{"$error":"#VALUE!"}},{"$f":"IF(Z9>=0, \"cases 1, 2, 3\",\"\")","v":{"$error":"#VALUE!"}},{"$f":"IF(Z9<0, \"cases 4, 5\",\"\")","v":{"$error":"#VALUE!"}},{"$f":"IF(AB9=\"\",\"\",IF($D$8<=Z9,1,IF($D$8>=Y9,3,2)))","v":{"$error":"#VALUE!"}},{"$f":"IF(AC9=\"\",\"\",IF($D$8<Y9,4,5))","v":{"$error":"#VALUE!"}},{"$f":"IF(AD9<>\"\",AD9,AE9)","v":{"$error":"#VALUE!"}},{"$f":"IF(AF9=1,($D$7-$D$5)*$D$8*$D$9,\"\")","v":{"$error":"#VALUE!"}},{"$f":"IF(AF9=2,(($D$7-$D$5)*Z9+0.5*(AA9-$D$5+$D$7-$D$5)*($D$8-Z9))*$D$9,\"\")","v":{"$error":"#VALUE!"}},{"$f":"IF(AF9=3,(($D$7-$D$5)*Z9+0.5*($D$7-$D$5)*(Y9-Z9))*$D$9,\"\")","v":{"$error":"#VALUE!"}},{"$f":"IF(AF9=4,0.5*$D$8*(X9-$D$5+AA9-$D$5)*$D$9,\"\")","v":{"$error":"#VALUE!"}},{"$f":"IF(AF9=5,0.5*Y9*(X9-$D$5)*$D$9,\"\")","v":{"$error":"#VALUE!"}},{"$f":"IF(AG9<>\"\",AG9,IF(AH9<>\"\",AH9,IF(AI9<>\"\",AI9,IF(AJ9<>\"\",AJ9,IF(AK9<>\"\",AK9)))))","v":{"$error":"#VALUE!"}},{"$f":"($D$5+X9)/2","v":219.33056653896364},{"$f":"AM9-$D$5","v":119.33056653896364},{"$f":"MIN(Y9,$D$8)","v":{"$error":"#VALUE!"}},{"$f":"AN9*AO9*$D$9","v":{"$error":"#VALUE!"}},{"$f":"AP9/AL9","v":{"$error":"#VALUE!"}},{"$f":"($D$11+$D$10)","v":{"$error":"#VALUE!"}},{"$f":"($D$12+$D$10)","v":{"$error":"#VALUE!"}},{"$f":"($D$10+$D$11+$D$13)","v":{"$error":"#VALUE!"}},{"$f":"($D$10+$D$12+$D$14)","v":{"$error":"#VALUE!"}},{"$f":"$AL9/AR9","v":{"$error":"#VALUE!"}},{"$error":"#VALUE!"},{"$error":"#VALUE!"},{"$error":"#VALUE!"},74.905115997046877,49.445878152083843,36.903034760608328,29.436047635422497,24.482284275201376,null,null,null,null,null,"New Stripe","PCC","Yellow Edge",{"$f":"AV10","v":{"$error":"#VALUE!"}},2621.4328879583481,4915.8913788620193,2038.4560178473998,708.3804241650945,195.64378622911002,null,2057.4810835189182,4025.220137889366,5811.2416583053619,7405.6658535886008,6440.8505419572884,null,{"$f":"AL10","v":{"$error":"#VALUE!"}},2500000,4970052.0104158605,7289493.6888617631,9435025.6561157759,11408928.346336108]
[null,"User Cost/Mile Due to Application","User Cost","",null,{"$f":"Input!B23/100","v":0.15},{"$f":"Input!B24/100","v":0.15},null,null,null,null,null,null,null,null,null,null,null,null,null,null,null,"Yellow",{"$f":"EXP(5.3943)","v":220.1479895549619},{"$f":"(LN($D$6)-5.3943)/(-0.0079-0.0559*30/1000000*$D$9)","v":{"$error":"#VALUE!"}},{"$f":"(LN($D$7)-5.3943)/(-0.0079-0.0559*30/1000000*$D$9)","v":{"$error":"#VALUE!"}},{"$f":"EXP(5.3943-0.0079*$D$8-0.0559*30*$D$8*$D$9/1000000)","v":{"$error":"#VALUE!"}},{"$f":"IF(Z10>=0, \"cases 1, 2, 3\",\"\")","v":{"$error":"#VALUE!"}},{"$f":"IF(Z10<0, \"cases 4, 5\",\"\")","v":{"$error":"#VALUE!"}},{"$f":"IF(AB10=\"\",\"\",IF($D$8<=Z10,1,IF($D$8>=Y10,3,2)))","v":{"$error":"#VALUE!"}},{"$f":"IF(AC10=\"\",\"\",IF($D$8<Y10,4,5))","v":{"$error":"#VALUE!"}},{"$f":"IF(AD10<>\"\",AD10,AE10)","v":{"$error":"#VALUE!"}},{"$f":"IF(AF10=1,($D$7-$D$6)*$D$8*$D$9,\"\")","v":{"$error":"#VALUE!"}},{"$f":"IF(AF10=2,(($D$7-$D$6)*Z10+0.5*(AA10-$D$6+$D$7-$D$6)*($D$8-Z10))*$D$9,\"\")","v":{"$error":"#VALUE!"}},{"$f":"IF(AF10=3,(($D$7-$D$6)*Z10+0.5*($D$7-$D$6)*(Y10-Z10))*$D$9,\"\")","v":{"$error":"#VALUE!"}},{"$f":"IF(AF10=4,0.5*$D$8*(X10-$D$6+AA10-$D$6)*$D$9,\"\")","v":{"$error":"#VALUE!"}},{"$f":"IF(AF10=5,0.5*Y10*(X10-$D$6)*$D$9,\"\")","v":{"$error":"#VALUE!"}},{"$f":"IF(AG10<>\"\",AG10,IF(AH10<>\"\",AH10,IF(AI10<>\"\",AI10,IF(AJ10<>\"\",AJ10,IF(AK10<>\"\",AK10)))))","v":{"$error":"#VALUE!"}},{"$f":"($D$6+X10)/2","v":160.07399477748095},{"$f":"AM10-$D$6","v":60.073994777480948},{"$f":"MIN(Y10,$D$8)","v":{"$error":"#VALUE!"}},{"$f":"AN10*AO10*$D$9","v":{"$error":"#VALUE!"}},{"$f":"AP10/AL10","v":{"$error":"#VALUE!"}},{"$f":"($D$11+$D$10)","v":{"$error":"#VALUE!"}},{"$f":"($D$12+$D$10)","v":{"$error":"#VALUE!"}},{"$f":"($D$10+$D$11+$D$13)","v":{"$error":"#VALUE!"}},{"$f":"($D$10+$D$12+$D$14)","v":{"$error":"#VALUE!"}},{"$error":"#VALUE!"},{"$error":"#VALUE!"},{"$error":"#VALUE!"},{"$error":"#VALUE!"},48.457464784274393,31.987426591483928,23.873235940460095,19.042707867082733,15.838029383078949,null,null,null,null,null,null,null,"White Edge",{"$f":"AV9","v":{"$error":"#VALUE!"}},2621.4328879583481,4945.5130133041512,2097.3226380888395,750.79861993371787,214.35381603121775,null,2057.4810835189182,4049.474864099624,5979.0589439546939,7849.1210554242152,7056.8093102558132,null,{"$f":"AL9","v":{"$error":"#VALUE!"}},2500000,5000000,7500000,10000000,12500000]
[null,"Application Cost/Mile (Solid)","Solid",1194.8499999999999,{"$f":"Input!B19","v":1039},{"$f":"(1-$F$10)*E11","v":883.15},{"$f":"(1+$G$10)*E11","v":1194.8499999999999},null,null,null,null,null,null,null,null,null,null,null,null,null,null,"AC","White",{"$f":"EXP(6.094)*EXP(-0.0383*D9/1000)","v":{"$error":"#VALUE!"}},{"$f":"(LN($D$5)-6.094+0.0383*$D$9/1000)/(-0.0165)","v":{"$error":"#VALUE!"}},{"$f":"(LN($D$7)-6.094+0.0383*$D$9/1000)/(-0.0165)","v":{"$error":"#VALUE!"}},{"$f":"EXP(6.094-0.0383*$D$9/1000-0.0165*$D$8)","v":{"$error":"#VALUE!"}},{"$f":"IF(Z11>=0, \"cases 1, 2, 3\",\"\")","v":{"$error":"#VALUE!"}},{"$f":"IF(Z11<0, \"cases 4, 5\",\"\")","v":{"$error":"#VALUE!"}},{"$f":"IF(AB11=\"\",\"\",IF($D$8<=Z11,1,IF($D$8>=Y11,3,2)))","v":{"$error":"#VALUE!"}},{"$f":"IF(AC11=\"\",\"\",IF($D$8<Y11,4,5))","v":{"$error":"#VALUE!"}},{"$f":"IF(AD11<>\"\",AD11,AE11)","v":{"$error":"#VALUE!"}},{"$f":"IF(AF11=1,($D$7-$D$5)*$D$8*$D$9,\"\")","v":{"$error":"#VALUE!"}},{"$f":"IF(AF11=2,(($D$7-$D$5)*Z11+0.5*(AA11-$D$5+$D$7-$D$5)*($D$8-Z11))*$D$9,\"\")","v":{"$error":"#VALUE!"}},{"$f":"IF(AF11=3,(($D$7-$D$5)*Z11+0.5*($D$7-$D$5)*(Y11-Z11))*$D$9,\"\")","v":{"$error":"#VALUE!"}},{"$f":"IF(AF11=4,0.5*$D$8*(X11-$D$5+AA11-$D$5)*$D$9,\"\")","v":{"$error":"#VALUE!"}},{"$f":"IF(AF11=5,0.5*Y11*(X11-$D$5)*$D$9,\"\")","v":{"$error":"#VALUE!"}},{"$f":"IF(AG11<>\"\",AG11,IF(AH11<>\"\",AH11,IF(AI11<>\"\",AI11,IF(AJ11<>\"\",AJ11,IF(AK11<>\"\",AK11)))))","v":{"$error":"#VALUE!"}},{"$f":"($D$5+X11)/2","v":{"$error":"#VALUE!"}},{"$f":"AM11-$D$5","v":{"$error":"#VALUE!"}},{"$f":"MIN(Y11,$D$8)","v":{"$error":"#VALUE!"}},{"$f":"AN11*AO11*$D$9","v":{"$error":"#VALUE!"}},{"$f":"AP11/AL11","v":{"$error":"#VALUE!"}},{"$f":"($D$11+$D$10)","v":{"$error":"#VALUE!"}},{"$f":"($D$12+$D$10)","v":{"$error":"#VALUE!"}},{"$f":"($D$10+$D$11+$D$13)","v":{"$error":"#VALUE!"}},{"$f":"($D$10+$D$12+$D$14)","v":{"$error":"#VALUE!"}},{"$error":"#VALUE!"},{"$error":"#VALUE!"},{"$error":"#VALUE!"},{"$error":"#VALUE!"},78.626049334055054,67.019988727994445,55.413928121933843,43.807867515873241,32.201806909812632,null,null,null,null,null,null,null,"White Lane",{"$f":"AW9","v":{"$error":"#VALUE!"}},6205.3693738070524,10864.429200971095,2479.1849936651315,783.18650526312661,216.39775483431788,null,5320.5300099174683,10213.92034776356,14729.623039487173,18909.740028894084,12181.588137812227,null,{"$f":"AL9","v":{"$error":"#VALUE!"}},2500000,5000000,7500000,10000000,12500000]
[null,"Application Cost/Mile (Dash)","Dash ",449.65,{"$f":"Input!C19","v":391},{"$f":"(1-$F$10)*E12","v":332.34999999999997},{"$f":"(1+$G$10)*E12","v":449.65},null,null,null,null,null,null,null,null,null,null,null,null,null,null,null,"Yellow",{"$f":"EXP(5.6632)*EXP(-0.0383*D9/1000)","v":{"$error":"#VALUE!"}},{"$f":"(LN($D$6)-5.6632+0.0383*$D$9/1000)/(-0.0165)","v":{"$error":"#VALUE!"}},{"$f":"(LN($D$7)-5.6632+0.0383*$D$9/1000)/(-0.0165)","v":{"$error":"#VALUE!"}},{"$f":"EXP(5.6632-0.0383*$D$9/1000-0.0165*$D$8)","v":{"$error":"#VALUE!"}},{"$f":"IF(Z12>=0, \"cases 1, 2, 3\",\"\")","v":{"$error":"#VALUE!"}},{"$f":"IF(Z12<0, \"cases 4, 5\",\"\")","v":{"$error":"#VALUE!"}},{"$f":"IF(AB12=\"\",\"\",IF($D$8<=Z12,1,IF($D$8>=Y12,3,2)))","v":{"$error":"#VALUE!"}},{"$f":"IF(AC12=\"\",\"\",IF($D$8<Y12,4,5))","v":{"$error":"#VALUE!"}},{"$f":"IF(AD12<>\"\",AD12,AE12)","v":{"$error":"#VALUE!"}},{"$f":"IF(AF12=1,($D$7-$D$6)*$D$8*$D$9,\"\")","v":{"$error":"#VALUE!"}},{"$f":"IF(AF12=2,(($D$7-$D$6)*Z12+0.5*(AA12-$D$6+$D$7-$D$6)*($D$8-Z12))*$D$9,\"\")","v":{"$error":"#VALUE!"}},{"$f":"IF(AF12=3,(($D$7-$D$6)*Z12+0.5*($D$7-$D$6)*(Y12-Z12))*$D$9,\"\")","v":{"$error":"#VALUE!"}},{"$f":"IF(AF12=4,0.5*$D$8*(X12-$D$6+AA12-$D$6)*$D$9,\"\")","v":{"$error":"#VALUE!"}},{"$f":"IF(AF12=5,0.5*Y12*(X12-$D$6)*$D$9,\"\")","v":{"$error":"#VALUE!"}},{"$f":"IF(AG12<>\"\",AG12,IF(AH12<>\"\",AH12,IF(AI12<>\"\",AI12,IF(AJ12<>\"\",AJ12,IF(AK12<>\"\",AK12)))))","v":{"$error":"#VALUE!"}},{"$f":"($D$6+X12)/2","v":{"$error":"#VALUE!"}},{"$f":"AM12-$D$6","v":{"$error":"#VALUE!"}},{"$f":"MIN(Y12,$D$8)","v":{"$error":"#VALUE!"}},{"$f":"AN12*AO12*$D$9","v":{"$error":"#VALUE!"}},{"$f":"AP12/AL12","v":{"$error":"#VALUE!"}},{"$f":"($D$11+$D$10)","v":{"$error":"#VALUE!"}},{"$f":"($D$12+$D$10)","v":{"$error":"#VALUE!"}},{"$f":"($D$10+$D$11+$D$13)","v":{"$error":"#VALUE!"}},{"$f":"($D$10+$D$12+$D$14)","v":{"$error":"#VALUE!"}},{"$error":"#VALUE!"},{"$error":"#VALUE!"},{"$error":"#VALUE!"},{"$error":"#VALUE!"},52.516958424964116,40.910897818903514,29.304837212842905,17.6987766067823,6.0927160007216949,null,null,null,null,null,null,"AC","Yellow Edge",{"$f":"AV12","v":{"$error":"#VALUE!"}},2621.4328879583481,4383.3305374407473,1169.4154195895157,214.81890672928762,13.28457138423494,null,2057.4810835189182,3589.1497574985669,3333.7759278022222,2245.7947566031994,437.34554748199184,null,{"$f":"AL12","v":{"$error":"#VALUE!"}},2500000,4431623.7017766898,4181815.1807646956,2861205.4021656606,774687.12886712863]
[null,"Removal Cost/Mile (Solid)","Solid",6037.4999999999991,{"$f":"Input!D19","v":5250},{"$f":"(1-$F$10)*E13","v":4462.5},{"$f":"(1+$G$10)*E13","v":6037.4999999999991},null,null,null,null,null,null,null,null,null,null,null,null,null,null,null,null,null,null,null,null,null,null,null,null,null,null,null,null,null,null,null,null,null,null,null,null,null,null,null,null,null,null,null,null,null,null,null,null,null,null,null,null,null,null,null,null,"White Edge",{"$f":"AV11","v":{"$error":"#VALUE!"}},2621.4328879583481,4945.5130133041512,2097.3226380888395,726.06974610657403,135.86507074083858,null,2057.4810835189182,4049.474864099624,5979.0589439546939,7590.5964403274274,4472.8566717136582,null,{"$f":"AL11","v":{"$error":"#VALUE!"}},2500000,5000000,7500000,9670632.4016774707,7922944.4835875742]
[null,"Removal Cost/Mile (Dash)","Dash ",6037.4999999999991,{"$f":"Input!E19","v":5250},{"$f":"(1-$F$10)*E14","v":4462.5},{"$f":"(1+$G$10)*E14","v":6037.4999999999991},null,null,null,null,null,null,null,null,null,null,null,null,null,null,null,null,null,null,null,null,null,null,null,null,null,null,null,null,null,null,null,null,null,null,null,null,null,null,null,null,null,null,null,null,null,null,null,null,null,null,null,null,null,null,null,null,"White Lane",{"$f":"AW11","v":{"$error":"#VALUE!"}},6205.3693738070524,10864.429200971095,2479.1849936651315,757.39087943541358,137.16059183402362,null,5320.5300099174683,10213.92034776356,14729.623039487173,18286.914463072058,7721.1237230252173,null,{"$f":"AL11","v":{"$error":"#VALUE!"}},2500000,5000000,7500000,9670632.4016774707,7922944.4835875742]
[null,null,null,null,null,null,null,null,null,null,null,null,null,null,null,null,null,null,null,null,null,null,null,null,null,null,null,null,null,null,null,null,null,null,null,null,null,null,null,null,null,null,null,null,null,null,null,null,null,null,null,null,null,null,null,null,null,null,null,null,null,"Restripe","PCC","Yellow Edge",{"$f":"AX10","v":{"$error":"#VALUE!"}},461.58019658939554,908.01793319823605,906.82401245151482,530.60459852863767,181.73652372690941,null,344.70501385852037,683.42906883775663,999.67301823505056,1290.4314469035444,1461.0275185064554,null,{"$f":"AL10","v":{"$error":"#VALUE!"}},2500000,4970052.0104158605,7289493.6888617631,9435025.6561157759,11408928.346336108]
[null,null,null,null,null,null,null,null,null,null,null,null,null,null,null,null,null,null,null,null,null,null,null,null,null,null,null,null,null,null,null,null,null,null,null,null,null,null,null,null,null,null,null,null,null,null,null,null,null,null,null,null,null,null,null,null,null,null,null,null,null,null,null,"White Edge",{"$f":"AX9","v":{"$error":"#VALUE!"}},461.58019658939554,913.48936720911615,933.01131514503709,562.37748350445679,199.11655833265962,null,344.70501385852037,687.54720011528798,1028.5416184966343,1367.703166834621,1600.7501692475498,null,{"$f":"AL9","v":{"$error":"#VALUE!"}},2500000,5000000,7500000,10000000,12500000]
[null,null,null,null,null,null,null,null,null,null,null,null,null,null,null,null,null,null,null,null,null,null,null,null,null,null,null,null,null,null,null,null,null,null,null,null,null,null,null,null,null,null,null,null,null,null,null,null,null,null,null,null,null,null,null,null,null,null,null,null,null,null,null,"White Lane",{"$f":"AY9","v":{"$error":"#VALUE!"}},513.83480652208482,1015.6991624396438,1001.6443366539538,580.35439726520622,200.87904536951118,null,384.17931154452691,766.0454344611361,1145.6191980115718,1522.9211821279719,1769.6261640626999,null,{"$f":"AL9","v":{"$error":"#VALUE!"}},2500000,5000000,7500000,10000000,12500000]
[null,null,null,null,null,null,null,null,null,null,null,null,null,null,null,null,null,null,null,null,null,null,null,null,null,null,null,null,null,null,null,null,null,null,null,null,null,null,null,null,null,null,null,null,null,null,null,null,null,null,null,null,null,null,null,null,null,null,null,null,null,null,"AC","Yellow Edge",{"$f":"AX12","v":{"$error":"#VALUE!"}},461.58019658939554,809.6482262089819,520.22411753316658,160.90774938592816,12.340242790770578,null,344.70501385852037,609.39009362422223,573.48946057033538,391.3279689506299,99.206444211836356,null,{"$f":"AL12","v":{"$error":"#VALUE!"}},2500000,4431623.7017766898,4181815.1807646956,2861205.4021656606,774687.12886712863]
[null,null,null,null,null,null,null,null,null,null,null,null,null,null,null,null,null,null,null,null,null,null,null,null,null,null,null,null,null,null,null,null,null,null,null,null,null,null,null,null,null,null,null,null,null,null,null,null,null,null,null,null,null,null,null,null,null,null,null,null,null,null,null,"White Edge",{"$f":"AX11","v":{"$error":"#VALUE!"}},461.58019658939554,913.48936720911615,933.01131514503709,543.85459139520367,126.20715499461512,null,344.70501385852037,687.54720011528798,1028.5416184966343,1322.6554561067771,1014.61237784334,null,{"$f":"AL11","v":{"$error":"#VALUE!"}},2500000,5000000,7500000,9670632.4016774707,7922944.4835875742]
[null,null,null,null,null,null,null,null,null,null,null,null,null,null,null,null,null,null,null,null,null,null,null,null,null,null,null,null,null,null,null,null,null,null,null,null,null,null,null,null,null,null,null,null,null,null,null,null,null,null,null,null,null,null,null,null,null,null,null,null,null,null,null,"White Lane",{"$f":"AY11","v":{"$error":"#VALUE!"}},513.83480652208482,1015.6991624396438,1001.6443366539538,561.23940386489028,127.32428195029652,null,384.17931154452691,766.0454344611361,1145.6191980115718,1472.7610929087721,1121.6519883658248,null,{"$f":"AL11","v":{"$error":"#VALUE!"}},2500000,5000000,7500000,9670632.4016774707,7922944.4835875742]
[]
[]
[]
[]
[]
[]
[]
[]
[]
[]
[null,null,null,null,"urban/rural off peak user costs"]
[null,null,"ADT/Lane",5000,10000,15000,20000,25000,{"$f":"Input!B33","v":"No"}]
[null,null,"User Cost",{"$f":"Input!C28","v":70.526903758950084},{"$f":"Input!C29","v":127.86745896720328},{"$f":"Input!C30","v":2692.8377206276123},{"$f":"Input!C31","v":12436.000747617014},{"$f":"Input!C32","v":57431.650414747659},{"$f":"Input!C33","v":""}]
[]
[]
[]
[null,null,null,null,"urban night user costs"]
[null,null,"ADT/Lane",5000,10000,15000,20000,25000,{"$f":"Input!B33","v":"No"}]
[null,null,"User Cost",{"$f":"Input!D28","v":20.227999999999998},{"$f":"Input!D29","v":39.878},{"$f":"Input!D30","v":59.528000000000006},{"$f":"Input!D31","v":79.177999999999997},{"$f":"Input!D32","v":576.48878080473003},{"$f":"Input!D33","v":""}]
[]
[]
[]
[]
[]
[]
[]
[]
[]
[]
[]
[]
[]
[]
[]
[]
[]
[]
[]
[null,null,null,null,null,null,null,null,null,null,null,null,null,null,null,null,null,null,null,null,null,null,null,null,null,null,null,null,null,null,null,null,null,null,null,null,null,null,null,null,null,null,null,null,null,null,null,null,null,null,null,null,null,null,null,null,null,null,null,null,null,null,null,null,null,null,null,null,null,null,null,null,null,null,null,null,null,null,null,null,null,null,null,null,null,"Calculating…Thermo 40"]

{"sheet":"inverted","index":9,"n_rows":59,"n_cols":86,"rows_kept":59,"cut":false,"hidden":true,"merged":[[0,0,13,0],[8,61,13,61],[6,20,7,20],[6,21,7,21],[6,22,7,22],[6,38,6,41],[6,27,6,31],[6,32,6,37],[6,23,7,23],[4,47,4,50],[5,43,5,46],[5,47,5,50],[6,26,7,26],[6,24,7,24],[6,25,7,25],[5,77,5,83],[6,77,7,77],[6,78,6,83],[5,64,7,64],[5,65,5,69],[6,65,6,69],[5,71,5,75],[6,71,6,75],[5,63,7,63],[5,62,7,62],[6,42,7,42],[6,43,6,44],[5,61,7,61],[6,45,6,46],[6,47,6,48],[6,49,6,50],[5,51,5,56],[6,51,6,55],[8,62,10,62],[11,62,13,62],[14,62,16,62],[17,62,19,62],[8,20,11,20],[8,21,9,21],[10,21,11,21],[14,61,19,61]]}
["Input Values","Marking Material Type","Material","Tape"]
[null,"Marking Color","Color"]
[null,"Initial Retroreflectivity","R(initial)"]
[null,"Retroreflectivity Decay Rate","R(decay)"]
[null,"Minimum Effective Retroreflectivity (white)","R(min) (white)",{"$f":"Input!B10","v":100},null,null,null,null,null,null,null,null,null,null,null,null,null,null,null,null,null,null,null,null,null,null,null,null,null,null,null,null,null,null,null,null,null,null,null,null,null,null,null,null,null,null,null,"use this as criteria"]
[null,"Minimum Effective Retroreflectivity (yellow)","R(min) (yellow)",{"$f":"Input!B11","v":100},null,null,null,null,null,null,null,null,null,null,null,null,null,null,null,null,null,null,null,null,null,null,null,null,null,null,null,null,null,null,null,null,null,null,null,null,null,null,null,"Cost",null,null,null,"Life Time Utility/Cost",null,null,null,"Expected PM Life Time",null,null,null,null,null,null,null,null,null,"Application Type","Pavement Type","Line Type","utility /cost","Off-Peak Application",null,null,null,null,null,"Night Time Application",null,null,null,null,null,"Utility"]
[null,"Maximum Effectove Retroreflectivity","R(max)",{"$f":"Input!B12","v":200},null,null,null,null,null,null,null,null,null,null,null,null,null,null,null,null,"Material","Pavement","Color","Initial Retro","Month (R=min)","Month (R=max)","Retro [M(max)]","utility has 5 scenarios, now identify them",null,null,null,null,"Utility has 5 equations based on the values of M(s), M(max), ,M(min), and initial retro value",null,null,null,null,null,"Simplified Kansas Utility",null,null,null,"Over Estimate Utility","New Stripe",null,"Restripe",null,"New Stripe",null,"Restripe",null,"ADT Per Lane",null,null,null,null,"User Specify",null,null,null,null,null,null,null,null,"ADT Per Lane",null,null,null,null,null,"ADT Per Lane",null,null,null,null,null,"Utility","ADT Per Lane"]
[null,"Maximum Pavement Remaining Service Life in Month","M(max)",{"$f":"Input!B13","v":100},null,null,null,null,null,null,null,null,null,null,null,null,null,null,null,null,null,null,null,null,null,null,null," test cases 1, 2, 3","test cases 4, 5","for cases 1, 2, 3","for cases 4, 5","final case","case 1","case 2","case 3","case 4","case 5","final utililty","Average Retro","Average Useful Retro","Service Years","Utility",null,"Solid","Dash","Solid","Dash","Solid","Dash","Solid","Dash",5000,10000,15000,20000,25000,{"$f":"Input!B33","v":"No"},null,null,null,null,null,null,null,null,5000,10000,15000,20000,25000,{"$f":"Input!B33","v":"No"},5000,{"$f":"BO8","v":10000},{"$f":"BP8","v":15000},{"$f":"BQ8","v":20000},{"$f":"BR8","v":25000},{"$f":"Input!B33","v":"No"},null,5000,10000,15000,20000,25000,{"$f":"Input!B33","v":"No"}]
[null,"ADT Per Lane","ADT","No","average costs","% less for off-peak","% more for night time",null,null,null,null,null,null,null,null,null,null,null,null,null,"Inverted","PCC","White",{"$f":"EXP(6.1985)*EXP(-0.0484*D9/1000)","v":{"$error":"#VALUE!"}},{"$f":"(LN($D$5)-6.1985+0.0484*$D$9/1000)/(-0.0129)","v":{"$error":"#VALUE!"}},{"$f":"(LN($D$7)-6.1985+0.0484*$D$9/1000)/(-0.0129)","v":{"$error":"#VALUE!"}},{"$f":"EXP(6.1985-0.0484*$D$9/1000-0.0129*$D$8)","v":{"$error":"#VALUE!"}},{"$f":"IF(Z9>=0, \"cases 1, 2, 3\",\"\")","v":{"$error":"#VALUE!"}},{"$f":"IF(Z9<0, \"cases 4, 5\",\"\")","v":{"$error":"#VALUE!"}},{"$f":"IF(AB9=\"\",\"\",IF($D$8<=Z9,1,IF($D$8>=Y9,3,2)))","v":{"$error":"#VALUE!"}},{"$f":"IF(AC9=\"\",\"\",IF($D$8<Y9,4,5))","v":{"$error":"#VALUE!"}},{"$f":"IF(AD9<>\"\",AD9,AE9)","v":{"$error":"#VALUE!"}},{"$f":"IF(AF9=1,($D$7-$D$5)*$D$8*$D$9,\"\")","v":{"$error":"#VALUE!"}},{"$f":"IF(AF9=2,(($D$7-$D$5)*Z9+0.5*(AA9-$D$5+$D$7-$D$5)*($D$8-Z9))*$D$9,\"\")","v":{"$error":"#VALUE!"}},{"$f":"IF(AF9=3,(($D$7-$D$5)*Z9+0.5*($D$7-$D$5)*(Y9-Z9))*$D$9,\"\")","v":{"$error":"#VALUE!"}},{"$f":"IF(AF9=4,0.5*$D$8*(X9-$D$5+AA9-$D$5)*$D$9,\"\")","v":{"$error":"#VALUE!"}},{"$f":"IF(AF9=5,0.5*Y9*(X9-$D$5)*$D$9,\"\")","v":{"$error":"#VALUE!"}},{"$f":"IF(AG9<>\"\",AG9,IF(AH9<>\"\",AH9,IF(AI9<>\"\",AI9,IF(AJ9<>\"\",AJ9,IF(AK9<>\"\",AK9)))))","v":{"$error":"#VALUE!"}},{"$f":"($D$5+X9)/2","v":{"$error":"#VALUE!"}},{"$f":"AM9-$D$5","v":{"$error":"#VALUE!"}},{"$f":"MIN(Y9,$D$8)","v":{"$error":"#VALUE!"}},{"$f":"AN9*AO9*$D$9","v":{"$error":"#VALUE!"}},{"$f":"AP9/AL9","v":{"$error":"#VALUE!"}},{"$f":"($D$11+$D$10)","v":{"$error":"#VALUE!"}},{"$f":"($D$12+$D$10)","v":{"$error":"#VALUE!"}},{"$f":"($D$10+$D$11+$D$13)","v":{"$error":"#VALUE!"}},{"$f":"($D$10+$D$12+$D$14)","v":{"$error":"#VALUE!"}},{"$f":"$AL9/AR9","v":{"$error":"#VALUE!"}},{"$error":"#VALUE!"},{"$error":"#VALUE!"},{"$error":"#VALUE!"},104.75424914820995,85.994559225729333,67.234869303248715,48.47517938076809,29.715489458287468,null,null,null,null,null,"New Stripe","PCC","Yellow Edge",{"$f":"AV10","v":{"$error":"#VALUE!"}},549.44730061588325,1085.2184125814895,1045.6841677198261,591.17374940311822,201.90224081222073,null,411.13498252182967,819.62134149719918,1225.4845892861929,1628.7499116403176,1883.3842293288292,null,{"$f":"AL10","v":{"$error":"#VALUE!"}},2500000,5000000,7500000,10000000,12500000]
[null,"User Cost/Mile Due to Application","User Cost","",null,{"$f":"Input!B23/100","v":0.15},{"$f":"Input!B24/100","v":0.15},null,null,null,null,null,null,null,null,null,null,null,null,null,"Inverted","PCC","Yellow",{"$f":"EXP(5.6434)","v":282.42132041794548},{"$f":"(LN($D$6)-5.6434)/(-0.0177)","v":58.657051639090845},{"$f":"(LN($D$7)-5.6434)/(-0.0177)","v":19.496193980336916},{"$f":"EXP(5.6434-0.0177*$D$8)","v":48.105667614807288},{"$f":"IF(Z10>=0, \"cases 1, 2, 3\",\"\")","v":"cases 1, 2, 3"},{"$f":"IF(Z10<0, \"cases 4, 5\",\"\")","v":""},{"$f":"IF(AB10=\"\",\"\",IF($D$8<=Z10,1,IF($D$8>=Y10,3,2)))","v":3},{"$f":"IF(AC10=\"\",\"\",IF($D$8<Y10,4,5))","v":""},{"$f":"IF(AD10<>\"\",AD10,AE10)","v":3},{"$f":"IF(AF10=1,($D$7-$D$6)*$D$8*$D$9,\"\")","v":""},{"$f":"IF(AF10=2,(($D$7-$D$6)*Z10+0.5*(AA10-$D$6+$D$7-$D$6)*($D$8-Z10))*$D$9,\"\")","v":""},{"$f":"IF(AF10=3,(($D$7-$D$6)*Z10+0.5*($D$7-$D$6)*(Y10-Z10))*$D$9,\"\")","v":{"$error":"#VALUE!"}},{"$f":"IF(AF10=4,0.5*$D$8*(X10-$D$6+AA10-$D$6)*$D$9,\"\")","v":""},{"$f":"IF(AF10=5,0.5*Y10*(X10-$D$6)*$D$9,\"\")","v":""},{"$f":"IF(AG10<>\"\",AG10,IF(AH10<>\"\",AH10,IF(AI10<>\"\",AI10,IF(AJ10<>\"\",AJ10,IF(AK10<>\"\",AK10)))))","v":{"$error":"#VALUE!"}},{"$f":"($D$5+X10)/2","v":191.21066020897274},{"$f":"AM10-$D$5","v":91.21066020897274},{"$f":"MIN(Y10,$D$8)","v":58.657051639090845},{"$f":"AN10*AO10*$D$9","v":{"$error":"#VALUE!"}},{"$f":"AP10/AL10","v":{"$error":"#VALUE!"}},{"$f":"($D$11+$D$10)","v":{"$error":"#VALUE!"}},{"$f":"($D$12+$D$10)","v":{"$error":"#VALUE!"}},{"$f":"($D$10+$D$11+$D$13)","v":{"$error":"#VALUE!"}},{"$f":"($D$10+$D$12+$D$14)","v":{"$error":"#VALUE!"}},{"$error":"#VALUE!"},{"$error":"#VALUE!"},{"$error":"#VALUE!"},{"$error":"#VALUE!"},58.657051639090845,58.657051639090845,58.657051639090845,58.657051639090845,58.657051639090845,null,null,null,null,null,null,null,"White Edge",{"$f":"AV9","v":{"$error":"#VALUE!"}},549.44730061588325,1085.2184125814895,1045.6841677198261,479.14279710588966,85.069394446450445,null,411.13498252182967,819.62134149719918,1225.4845892861929,1320.0920866957495,793.54421850131632,null,{"$f":"AL9","v":{"$error":"#VALUE!"}},2500000,5000000,7500000,8104940.3426599838,5266744.0752656925]
[null,"Application Cost/Mile (Solid)","Solid",6060.4999999999991,{"$f":"Input!B22","v":5270},{"$f":"(1-$F$10)*E11","v":4479.5},{"$f":"(1+$G$10)*E11","v":6060.4999999999991},null,null,null,null,null,null,null,null,null,null,null,null,null,"Inverted","AC","White",null,null,null,null,{"$f":"IF(Z11>=0, \"cases 1, 2, 3\",\"\")","v":"cases 1, 2, 3"},{"$f":"IF(Z11<0, \"cases 4, 5\",\"\")","v":""},{"$f":"IF(AB11=\"\",\"\",IF($D$8<=Z11,1,IF($D$8>=Y11,3,2)))","v":3},{"$f":"IF(AC11=\"\",\"\",IF($D$8<Y11,4,5))","v":""},{"$f":"IF(AD11<>\"\",AD11,AE11)","v":3},{"$f":"IF(AF11=1,($D$7-$D$5)*$D$8*$D$9,\"\")","v":""},{"$f":"IF(AF11=2,(($D$7-$D$5)*Z11+0.5*(AA11-$D$5+$D$7-$D$5)*($D$8-Z11))*$D$9,\"\")","v":""},{"$f":"IF(AF11=3,(($D$7-$D$5)*Z11+0.5*($D$7-$D$5)*(Y11-Z11))*$D$9,\"\")","v":{"$error":"#VALUE!"}},{"$f":"IF(AF11=4,0.5*$D$8*(X11-$D$5+AA11-$D$5)*$D$9,\"\")","v":""},{"$f":"IF(AF11=5,0.5*Y11*(X11-$D$5)*$D$9,\"\")","v":""},{"$f":"IF(AG11<>\"\",AG11,IF(AH11<>\"\",AH11,IF(AI11<>\"\",AI11,IF(AJ11<>\"\",AJ11,IF(AK11<>\"\",AK11)))))","v":{"$error":"#VALUE!"}},{"$f":"($D$6+X11)/2","v":50},{"$f":"AM11-$D$6","v":-50},{"$f":"MIN(Y11,$D$8)","v":100},{"$f":"AN11*AO11*$D$9","v":{"$error":"#VALUE!"}},null,null,null,null,null,null,null,null,null,null,null,null,null,null,null,null,null,null,null,null,null,"White Lane",{"$f":"AW9","v":{"$error":"#VALUE!"}},1136.4788837122676,2215.2147998039354,1555.3429208508564,556.45731632776824,88.426199714764778,null,861.77833820180638,1711.9605783413704,2550.7792120336921,2738.2221265719922,1523.3960999476494,null,{"$f":"AL9","v":{"$error":"#VALUE!"}},2500000,5000000,7500000,8104940.3426599838,5266744.0752656925]
[null,"Application Cost/Mile (Dash)","Dash ",2880.75,{"$f":"Input!C22","v":2505},{"$f":"(1-$F$10)*E12","v":2129.25},{"$f":"(1+$G$10)*E12","v":2880.75},null,null,null,null,null,null,null,null,null,null,null,null,null,"Inverted","PCC","Yellow",null,null,null,null,{"$f":"IF(Z12>=0, \"cases 1, 2, 3\",\"\")","v":"cases 1, 2, 3"},{"$f":"IF(Z12<0, \"cases 4, 5\",\"\")","v":""},{"$f":"IF(AB12=\"\",\"\",IF($D$8<=Z12,1,IF($D$8>=Y12,3,2)))","v":3},{"$f":"IF(AC12=\"\",\"\",IF($D$8<Y12,4,5))","v":""},{"$f":"IF(AD12<>\"\",AD12,AE12)","v":3},{"$f":"IF(AF12=1,($D$7-$D$6)*$D$8*$D$9,\"\")","v":""},{"$f":"IF(AF12=2,(($D$7-$D$6)*Z12+0.5*(AA12-$D$6+$D$7-$D$6)*($D$8-Z12))*$D$9,\"\")","v":""},{"$f":"IF(AF12=3,(($D$7-$D$6)*Z12+0.5*($D$7-$D$6)*(Y12-Z12))*$D$9,\"\")","v":{"$error":"#VALUE!"}},{"$f":"IF(AF12=4,0.5*$D$8*(X12-$D$6+AA12-$D$6)*$D$9,\"\")","v":""},{"$f":"IF(AF12=5,0.5*Y12*(X12-$D$6)*$D$9,\"\")","v":""},{"$f":"IF(AG12<>\"\",AG12,IF(AH12<>\"\",AH12,IF(AI12<>\"\",AI12,IF(AJ12<>\"\",AJ12,IF(AK12<>\"\",AK12)))))","v":{"$error":"#VALUE!"}},{"$f":"($D$6+X12)/2","v":50},{"$f":"AM12-$D$6","v":-50},{"$f":"MIN(Y12,$D$8)","v":100},{"$f":"AN12*AO12*$D$9","v":{"$error":"#VALUE!"}},null,null,null,null,null,null,null,null,null,null,null,null,null,null,null,null,null,null,null,null,"AC","Yellow Edge"]
[null,"Removal Cost/Mile (Dolid)","Removal",6037.4999999999991,{"$f":"Input!D22","v":5250},{"$f":"(1-$F$10)*E13","v":4462.5},{"$f":"(1+$G$10)*E13","v":6037.4999999999991},null,null,null,null,null,null,null,null,null,null,null,null,null,null,null,null,null,null,null,null,null,null,null,null,null,null,null,null,null,null,null,null,null,null,null,null,null,null,null,null,null,null,null,null,null,null,null,null,null,null,null,null,null,null,null,null,"White Edge"]
[null,"Removal Cost/Mile (Dash)","Dash ",6037.4999999999991,{"$f":"Input!E22","v":5250},{"$f":"(1-$F$10)*E14","v":4462.5},{"$f":"(1+$G$10)*E14","v":6037.4999999999991},null,null,null,null,null,null,null,null,null,null,null,null,null,null,null,null,null,null,null,null,null,null,null,null,null,null,null,null,null,null,null,null,null,null,null,null,null,null,null,null,null,null,null,null,null,null,null,null,null,null,null,null,null,null,null,null,"White Lane"]
[null,null,null,null,null,null,null,null,null,null,null,null,null,null,null,null,null,null,null,null,null,null,null,null,null,null,null,null,null,null,null,null,null,null,null,null,null,null,null,null,null,null,null,null,null,null,null,null,null,null,null,null,null,null,null,null,null,null,null,null,null,"Restripe","PCC","Yellow Edge",{"$f":"AX10","v":{"$error":"#VALUE!"}},277.39168234352775,551.27597207130032,644.61578064841547,467.77058893660535,188.32774635554185,null,206.30078919129102,411.93361805086533,616.90172541654863,821.20832922044838,986.23307150115693,null,{"$f":"AL10","v":{"$error":"#VALUE!"}},2500000,5000000,7500000,10000000,12500000]
[null,null,null,null,null,null,null,null,null,null,null,null,null,null,null,null,null,null,null,null,null,null,null,null,null,null,null,null,null,null,null,null,null,null,null,null,null,null,null,null,null,null,null,null,null,null,null,null,null,null,null,null,null,null,null,null,null,null,null,null,null,null,null,"White Edge",{"$f":"AX9","v":{"$error":"#VALUE!"}},277.39168234352775,551.27597207130032,644.61578064841547,379.12527173821127,79.349923386095213,null,206.30078919129102,411.93361805086533,616.90172541654863,665.58445172272138,415.53897489278432,null,{"$f":"AL9","v":{"$error":"#VALUE!"}},2500000,5000000,7500000,8104940.3426599838,5266744.0752656925]
[null,null,null,null,null,null,null,null,null,null,null,null,null,null,null,null,null,null,null,null,null,null,null,null,null,null,null,null,null,null,null,null,null,null,null,null,null,null,null,null,null,null,null,null,null,null,null,null,null,null,null,null,null,null,null,null,null,null,null,null,null,null,null,"White Lane",{"$f":"AY9","v":{"$error":"#VALUE!"}},375.24708686147,744.08997692682556,807.79031074661657,425.95367419741007,82.262798307296862,null,279.68967423760512,558.15232825429609,835.3960189258413,900.8063574012466,554.70131373317338,null,{"$f":"AL9","v":{"$error":"#VALUE!"}},2500000,5000000,7500000,8104940.3426599838,5266744.0752656925]
[null,null,null,null,null,null,null,null,null,null,null,null,null,null,null,null,null,null,null,null,null,null,null,null,null,null,null,null,null,null,null,null,null,null,null,null,null,null,null,null,null,null,null,null,null,null,null,null,null,null,null,null,null,null,null,null,null,null,null,null,null,null,"AC","Yellow Edge"]
[null,null,null,null,null,null,null,null,null,null,null,null,null,null,null,null,null,null,null,null,null,null,null,null,null,null,null,null,null,null,null,null,null,null,null,null,null,null,null,null,null,null,null,null,null,null,null,null,null,null,null,null,null,null,null,null,null,null,null,null,null,null,null,"White Edge"]
[null,null,null,null,null,null,null,null,null,null,null,null,null,null,null,null,null,null,null,null,null,null,null,null,null,null,null,null,null,null,null,null,null,null,null,null,null,null,null,null,null,null,null,null,null,null,null,null,null,null,null,null,null,null,null,null,null,null,null,null,null,null,null,"White Lane"]
[]
[]
[]
[]
[]
[]
[]
[]
[]
[]
[null,null,null,null,"urban/rural off peak user costs"]
[null,null,"ADT/Lane",5000,10000,15000,20000,25000,{"$f":"Input!B33","v":"No"}]
[null,null,"User Cost",{"$f":"Input!C28","v":70.526903758950084},{"$f":"Input!C29","v":127.86745896720328},{"$f":"Input!C30","v":2692.8377206276123},{"$f":"Input!C31","v":12436.000747617014},{"$f":"Input!C32","v":57431.650414747659},{"$f":"Input!C33","v":""}]
[]
[]
[]
[null,null,null,null,"urban night user costs"]
[null,null,"ADT/Lane",5000,10000,15000,20000,25000,{"$f":"Input!B33","v":"No"}]
[null,null,"User Cost",{"$f":"Input!D28","v":20.227999999999998},{"$f":"Input!D29","v":39.878},{"$f":"Input!D30","v":59.528000000000006},{"$f":"Input!D31","v":79.177999999999997},{"$f":"Input!D32","v":576.48878080473003},{"$f":"Input!D33","v":""}]
[]
[]
[]
[]
[]
[]
[]
[]
[]
[]
[]
[]
[]
[]
[]
[]
[]
[]
[]
[null,null,null,null,null,null,null,null,null,null,null,null,null,null,null,null,null,null,null,null,null,null,null,null,null,null,null,null,null,null,null,null,null,null,null,null,null,null,null,null,null,null,null,null,null,null,null,null,null,null,null,null,null,null,null,null,null,null,null,null,null,null,null,null,null,null,null,null,null,null,null,null,null,null,null,null,null,null,null,null,null,null,null,null,null,"Calculating…Inverted"]

{"sheet":"Factor Results","index":10,"n_rows":209,"n_cols":52,"rows_kept":209,"cut":false,"hidden":true,"merged":[[163,29,186,29],[163,45,186,45],[187,29,210,29],[187,45,210,45],[133,1,138,1],[133,2,135,2],[143,37,145,37],[136,2,138,2],[140,20,145,20],[140,21,142,21],[140,36,145,36],[143,21,145,21],[139,29,162,29],[139,45,162,45],[149,21,151,21],[149,37,151,37],[115,1,120,1],[115,2,117,2],[115,29,138,29],[121,1,126,1],[140,37,142,37],[138,36,138,44],[127,1,132,1],[127,2,129,2],[130,2,132,2],[121,2,123,2],[124,2,126,2],[146,20,151,20],[146,21,148,21],[146,36,151,36],[146,37,148,37],[118,2,120,2],[113,23,113,28],[113,30,113,35],[113,46,113,51],[115,45,138,45],[30,21,32,21],[33,21,35,21],[36,21,38,21],[39,21,41,21],[3,23,3,28],[29,29,52,29],[53,29,76,29],[77,45,100,45],[110,0,210,0],[111,30,111,51],[112,1,114,1],[112,2,114,2],[112,3,114,3],[112,5,112,10],[112,11,112,22],[112,30,112,35],[112,36,112,51],[113,5,113,6],[113,11,113,16],[113,17,113,22],[8,2,10,2],[11,1,16,1],[11,2,13,2],[5,45,28,45],[77,29,100,29],[30,20,35,20],[36,20,41,20],[2,2,4,2],[5,29,28,29],[30,36,35,36],[26,2,28,2],[23,1,28,1],[23,2,25,2],[2,3,4,3],[2,11,2,22],[3,5,3,6],[3,11,3,16],[3,17,3,22],[2,5,2,10],[14,2,16,2],[17,1,22,1],[17,2,19,2],[20,2,22,2],[0,0,100,0],[29,45,52,45],[53,45,76,45],[1,30,1,51],[2,36,2,51],[3,46,3,51],[3,30,3,35],[30,37,32,37],[33,37,35,37],[36,36,41,36],[36,37,38,37],[39,37,41,37],[5,1,10,1],[5,2,7,2],[2,30,2,35],[2,1,4,1]]}
["Calcluating Factors for Restripe"]
[null,null,null,null,null,null,null,null,null,null,null,null,null,null,null,null,null,null,null,null,null,null,null,null,null,null,null,null,null,null,"Factors for Restripe"]
[null,"Marking Type","Pavement Type","Line Type",null,"PM Costs",null,null,null,null,null,"User Cost",null,null,null,null,null,null,null,null,null,null,null,null,null,null,null,null,null,null,"Off-Peak Application",null,null,null,null,null,"Night Time Application"]
[null,null,null,null,null,"Average Costs",null,"Off-Peak Application",null,"Night Time Application",null,"Off-Peak Application",null,null,null,null,null,"Night Time Application",null,null,null,null,null,"Benefit",null,null,null,null,null,null,"Factors by Different References (40, 90, tape, and inverted)",null,null,null,null,null,null,null,null,null,null,null,null,null,null,null,"Factors by Different References (40, 90, tape, and inverted)"]
[null,null,null,null,null,"Application","Removal","Application","Removal","Application","Removal",5000,10000,15000,20000,25000,{"$f":"IF(Input!$B$33=\"No\",\"\",Input!$B$33)","v":""},5000,10000,15000,20000,25000,{"$f":"IF(Input!$B$33=\"No\",\"\",Input!$B$33)","v":""},5000,10000,15000,20000,25000,{"$f":"IF(Input!$B$33=\"No\",\"\",Input!$B$33)","v":""},null,5000,10000,15000,20000,25000,{"$f":"IF(Input!$B$33=\"No\",\"\",Input!$B$33)","v":""},null,null,null,null,null,null,null,null,null,null,5000,10000,15000,20000,25000,{"$f":"IF(Input!$B$33=\"No\",\"\",Input!$B$33)","v":""}]
[null,"Thermo (40 mil)","PCC","Yellow Edge","40 mil",{"$f":"Input!$B19","v":1039},{"$f":"Input!$D19","v":5250},{"$f":"F6*(1-Input!$B$23/100)","v":883.15},{"$f":"G6*(1-Input!$B$23/100)","v":4462.5},{"$f":"F6*(1+Input!$B$24/100)","v":1194.8499999999999},{"$f":"G6*(1+Input!$B$24/100)","v":6037.4999999999991},{"$f":"Input!C28","v":70.526903758950084},{"$f":"Input!C29","v":127.86745896720328},{"$f":"Input!C30","v":2692.8377206276123},{"$f":"Input!C31","v":12436.000747617014},{"$f":"Input!C32","v":57431.650414747659},{"$f":"Input!C33","v":""},{"$f":"Input!D28","v":20.227999999999998},{"$f":"Input!D29","v":39.878},{"$f":"Input!D30","v":59.528000000000006},{"$f":"Input!D31","v":79.177999999999997},{"$f":"Input!D32","v":576.48878080473003},{"$f":"Input!D33","v":""},{"$f":"'thermoplastic (40 mil)'!CA9","v":2500000},{"$f":"'thermoplastic (40 mil)'!CB9","v":4970052.0104158605},{"$f":"'thermoplastic (40 mil)'!CC9","v":7289493.6888617631},{"$f":"'thermoplastic (40 mil)'!CD9","v":9435025.6561157759},{"$f":"'thermoplastic (40 mil)'!CE9","v":11408928.346336108},{"$f":"'thermoplastic (40 mil)'!CF9","v":0},"40 mil",1,1,1,1,1,1,null,null,null,null,null,null,null,null,null,"40 mil",1,1,1,1,1,1]
[null,null,null,"White Edge","40 mil",{"$f":"Input!$B19","v":1039},{"$f":"Input!$D19","v":5250},{"$f":"F7*(1-Input!$B$23/100)","v":883.15},{"$f":"G7*(1-Input!$B$23/100)","v":4462.5},{"$f":"F7*(1+Input!$B$24/100)","v":1194.8499999999999},{"$f":"G7*(1+Input!$B$24/100)","v":6037.4999999999991},{"$f":"L6","v":70.526903758950084},{"$f":"M6","v":127.86745896720328},{"$f":"N6","v":2692.8377206276123},{"$f":"O6","v":12436.000747617014},{"$f":"P6","v":57431.650414747659},{"$f":"Q6","v":""},{"$f":"R6","v":20.227999999999998},{"$f":"S6","v":39.878},{"$f":"T6","v":59.528000000000006},{"$f":"U6","v":79.177999999999997},{"$f":"V6","v":576.48878080473003},{"$f":"W6","v":""},{"$f":"'thermoplastic (40 mil)'!CA10","v":2500000},{"$f":"'thermoplastic (40 mil)'!CB10","v":5000000},{"$f":"'thermoplastic (40 mil)'!CC10","v":7500000},{"$f":"'thermoplastic (40 mil)'!CD10","v":10000000},{"$f":"'thermoplastic (40 mil)'!CE10","v":12500000},{"$f":"'thermoplastic (40 mil)'!CF10","v":0},null,1,1,1,1,1,1,null,null,null,null,null,null,null,null,null,null,1,1,1,1,1,1]
[null,null,null,"White Lane","40 mil",{"$f":"Input!$C19","v":391},{"$f":"Input!$E19","v":5250},{"$f":"F8*(1-Input!$B$23/100)","v":332.34999999999997},{"$f":"G8*(1-Input!$B$23/100)","v":4462.5},{"$f":"F8*(1+Input!$B$24/100)","v":449.65},{"$f":"G8*(1+Input!$B$24/100)","v":6037.4999999999991},70.526903758950084,127.86745896720328,2692.8377206276123,12436.000747617014,57431.650414747659,"",20.227999999999998,39.878,59.528000000000006,79.177999999999997,576.48878080473003,"",{"$f":"'thermoplastic (40 mil)'!CA11","v":2500000},{"$f":"'thermoplastic (40 mil)'!CB11","v":5000000},{"$f":"'thermoplastic (40 mil)'!CC11","v":7500000},{"$f":"'thermoplastic (40 mil)'!CD11","v":10000000},{"$f":"'thermoplastic (40 mil)'!CE11","v":12500000},{"$f":"'thermoplastic (40 mil)'!CF11","v":0},null,1,1,1,1,1,1,null,null,null,null,null,null,null,null,null,null,1,1,1,1,1,1]
[null,null,"AC","Yellow Edge","40 mil",{"$f":"Input!$B19","v":1039},{"$f":"Input!$D19","v":5250},{"$f":"F9*(1-Input!$B$23/100)","v":883.15},{"$f":"G9*(1-Input!$B$23/100)","v":4462.5},{"$f":"F9*(1+Input!$B$24/100)","v":1194.8499999999999},{"$f":"G9*(1+Input!$B$24/100)","v":6037.4999999999991},70.526903758950084,127.86745896720328,2692.8377206276123,12436.000747617014,57431.650414747659,"",20.227999999999998,39.878,59.528000000000006,79.177999999999997,576.48878080473003,"",{"$f":"'thermoplastic (40 mil)'!CA12","v":2500000},{"$f":"'thermoplastic (40 mil)'!CB12","v":4431623.7017766898},{"$f":"'thermoplastic (40 mil)'!CC12","v":4181815.1807646956},{"$f":"'thermoplastic (40 mil)'!CD12","v":2861205.4021656606},{"$f":"'thermoplastic (40 mil)'!CE12","v":774687.12886712863},{"$f":"'thermoplastic (40 mil)'!CF12","v":0},null,1,1,1,1,1,1,null,null,null,null,null,null,null,null,null,null,1,1,1,1,1,1]
[null,null,null,"White Edge","40 mil",{"$f":"Input!$B19","v":1039},{"$f":"Input!$D19","v":5250},{"$f":"F10*(1-Input!$B$23/100)","v":883.15},{"$f":"G10*(1-Input!$B$23/100)","v":4462.5},{"$f":"F10*(1+Input!$B$24/100)","v":1194.8499999999999},{"$f":"G10*(1+Input!$B$24/100)","v":6037.4999999999991},70.526903758950084,127.86745896720328,2692.8377206276123,12436.000747617014,57431.650414747659,"",20.227999999999998,39.878,59.528000000000006,79.177999999999997,576.48878080473003,"",{"$f":"'thermoplastic (40 mil)'!CA13","v":2500000},{"$f":"'thermoplastic (40 mil)'!CB13","v":5000000},{"$f":"'thermoplastic (40 mil)'!CC13","v":7500000},{"$f":"'thermoplastic (40 mil)'!CD13","v":9670632.4016774707},{"$f":"'thermoplastic (40 mil)'!CE13","v":7922944.4835875742},{"$f":"'thermoplastic (40 mil)'!CF13","v":0},null,1,1,1,1,1,1,null,null,null,null,null,null,null,null,null,null,1,1,1,1,1,1]
[null,null,null,"White Lane","40 mil",{"$f":"Input!$C19","v":391},{"$f":"Input!$E19","v":5250},{"$f":"F11*(1-Input!$B$23/100)","v":332.34999999999997},{"$f":"G11*(1-Input!$B$23/100)","v":4462.5},{"$f":"F11*(1+Input!$B$24/100)","v":449.65},{"$f":"G11*(1+Input!$B$24/100)","v":6037.4999999999991},70.526903758950084,127.86745896720328,2692.8377206276123,12436.000747617014,57431.650414747659,"",20.227999999999998,39.878,59.528000000000006,79.177999999999997,576.48878080473003,"",{"$f":"'thermoplastic (40 mil)'!CA14","v":2500000},{"$f":"'thermoplastic (40 mil)'!CB14","v":5000000},{"$f":"'thermoplastic (40 mil)'!CC14","v":7500000},{"$f":"'thermoplastic (40 mil)'!CD14","v":9670632.4016774707},{"$f":"'thermoplastic (40 mil)'!CE14","v":7922944.4835875742},{"$f":"'thermoplastic (40 mil)'!CF14","v":0},null,1,1,1,1,1,1,null,null,null,null,null,null,null,null,null,null,1,1,1,1,1,1]
[null,"Thermo (90 mil)","PCC","Yellow Edge","90 mil",{"$f":"Input!$B20","v":2458},{"$f":"Input!$D20","v":5250},{"$f":"F12*(1-Input!$B$23/100)","v":2089.2999999999997},{"$f":"G12*(1-Input!$B$23/100)","v":4462.5},{"$f":"F12*(1+Input!$B$24/100)","v":2826.7},{"$f":"G12*(1+Input!$B$24/100)","v":6037.4999999999991},70.526903758950084,127.86745896720328,2692.8377206276123,12436.000747617014,57431.650414747659,"",20.227999999999998,39.878,59.528000000000006,79.177999999999997,576.48878080473003,"",{"$f":"'thermoplastic (90 mil)'!CA9","v":2500000},{"$f":"'thermoplastic (90 mil)'!CB9","v":5000000},{"$f":"'thermoplastic (90 mil)'!CC9","v":7500000},{"$f":"'thermoplastic (90 mil)'!CD9","v":10000000},{"$f":"'thermoplastic (90 mil)'!CE9","v":12500000},{"$f":"'thermoplastic (90 mil)'!CF9","v":0},null,{"$f":"X6/(X12+(X12-X6)*L12/($H6+$I6))","v":1},{"$f":"Y6/(Y12+(Y12-Y6)*M12/($H6+$I6))","v":0.99386800998304314},0.95838208896766963,0.83389950951233138,0.47101390048704794,{"$error":"#VALUE!"},null,null,null,null,null,null,null,null,null,null,{"$f":"X6/(X12+(X12-X6)*R12/($J6+$K6))","v":1},{"$f":"Y6/(Y12+(Y12-Y6)*S12/($J6+$K6))","v":0.99397757531035213},0.9717080098619012,0.94291935103835567,0.90640791331108095,{"$error":"#VALUE!"}]
[null,null,null,"White Edge","90 mil",{"$f":"Input!$B20","v":2458},{"$f":"Input!$D20","v":5250},{"$f":"F13*(1-Input!$B$23/100)","v":2089.2999999999997},{"$f":"G13*(1-Input!$B$23/100)","v":4462.5},{"$f":"F13*(1+Input!$B$24/100)","v":2826.7},{"$f":"G13*(1+Input!$B$24/100)","v":6037.4999999999991},70.526903758950084,127.86745896720328,2692.8377206276123,12436.000747617014,57431.650414747659,"",20.227999999999998,39.878,59.528000000000006,79.177999999999997,576.48878080473003,"",{"$f":"'thermoplastic (90 mil)'!CA10","v":2500000},{"$f":"'thermoplastic (90 mil)'!CB10","v":5000000},{"$f":"'thermoplastic (90 mil)'!CC10","v":7500000},{"$f":"'thermoplastic (90 mil)'!CD10","v":10000000},{"$f":"'thermoplastic (90 mil)'!CE10","v":12500000},{"$f":"'thermoplastic (90 mil)'!CF10","v":0},null,{"$f":"X7/(X13+(X13-X7)*L13/($H7+$I7))","v":1},1,1,1,1,{"$error":"#VALUE!"},null,null,null,null,null,null,null,null,null,null,1,{"$f":"Y7/(Y13+(Y13-Y7)*S13/($J7+$K7))","v":1},1,1,1,{"$error":"#VALUE!"}]
[null,null,null,"White Lane","90 mil",{"$f":"Input!$C20","v":817},{"$f":"Input!$E20","v":5250},{"$f":"F14*(1-Input!$B$23/100)","v":694.44999999999993},{"$f":"G14*(1-Input!$B$23/100)","v":4462.5},{"$f":"F14*(1+Input!$B$24/100)","v":939.55},{"$f":"G14*(1+Input!$B$24/100)","v":6037.4999999999991},70.526903758950084,127.86745896720328,2692.8377206276123,12436.000747617014,57431.650414747659,"",20.227999999999998,39.878,59.528000000000006,79.177999999999997,576.48878080473003,"",{"$f":"'thermoplastic (90 mil)'!CA11","v":2500000},{"$f":"'thermoplastic (90 mil)'!CB11","v":5000000},{"$f":"'thermoplastic (90 mil)'!CC11","v":7500000},{"$f":"'thermoplastic (90 mil)'!CD11","v":10000000},{"$f":"'thermoplastic (90 mil)'!CE11","v":12500000},{"$f":"'thermoplastic (90 mil)'!CF11","v":0},null,1,1,1,1,1,{"$error":"#VALUE!"},null,null,null,null,null,null,null,null,null,null,1,{"$f":"Y8/(Y14+(Y14-Y8)*S14/($J8+$K8))","v":1},1,1,1,{"$error":"#VALUE!"}]
[null,null,"AC","Yellow Edge","90 mil",{"$f":"Input!$B20","v":2458},{"$f":"Input!$D20","v":5250},{"$f":"F15*(1-Input!$B$23/100)","v":2089.2999999999997},{"$f":"G15*(1-Input!$B$23/100)","v":4462.5},{"$f":"F15*(1+Input!$B$24/100)","v":2826.7},{"$f":"G15*(1+Input!$B$24/100)","v":6037.4999999999991},70.526903758950084,127.86745896720328,2692.8377206276123,12436.000747617014,57431.650414747659,"",20.227999999999998,39.878,59.528000000000006,79.177999999999997,576.48878080473003,"",{"$f":"'thermoplastic (90 mil)'!CA12","v":2500000},{"$f":"'thermoplastic (90 mil)'!CB12","v":5000000},{"$f":"'thermoplastic (90 mil)'!CC12","v":7500000},{"$f":"'thermoplastic (90 mil)'!CD12","v":10000000},{"$f":"'thermoplastic (90 mil)'!CE12","v":12500000},{"$f":"'thermoplastic (90 mil)'!CF12","v":0},null,1,0.88392126843319141,0.45595686849630079,0.10753366270836925,5.5945259316757655E-3,{"$error":"#VALUE!"},null,null,null,null,null,null,null,null,null,null,1,{"$f":"Y9/(Y15+(Y15-Y9)*S15/($J9+$K9))","v":0.88576955163238247},0.55555230973592507,0.2839017408445671,5.7663486595376338E-2,{"$error":"#VALUE!"}]
[null,null,null,"White Edge","90 mil",{"$f":"Input!$B20","v":2458},{"$f":"Input!$D20","v":5250},{"$f":"F16*(1-Input!$B$23/100)","v":2089.2999999999997},{"$f":"G16*(1-Input!$B$23/100)","v":4462.5},{"$f":"F16*(1+Input!$B$24/100)","v":2826.7},{"$f":"G16*(1+Input!$B$24/100)","v":6037.4999999999991},70.526903758950084,127.86745896720328,2692.8377206276123,12436.000747617014,57431.650414747659,"",20.227999999999998,39.878,59.528000000000006,79.177999999999997,576.48878080473003,"",{"$f":"'thermoplastic (90 mil)'!CA13","v":2500000},{"$f":"'thermoplastic (90 mil)'!CB13","v":5000000},{"$f":"'thermoplastic (90 mil)'!CC13","v":7500000},{"$f":"'thermoplastic (90 mil)'!CD13","v":10000000},{"$f":"'thermoplastic (90 mil)'!CE13","v":12500000},{"$f":"'thermoplastic (90 mil)'!CF13","v":0},null,1,1,1,0.89823729632280092,0.12846456909699536,{"$error":"#VALUE!"},null,null,null,null,null,null,null,null,null,null,1,{"$f":"Y10/(Y16+(Y16-Y10)*S16/($J10+$K10))","v":1},1,0.96671465871987117,0.6158605150765728,{"$error":"#VALUE!"}]
[null,null,null,"White Lane","90 mil",{"$f":"Input!$C20","v":817},{"$f":"Input!$E20","v":5250},{"$f":"F17*(1-Input!$B$23/100)","v":694.44999999999993},{"$f":"G17*(1-Input!$B$23/100)","v":4462.5},{"$f":"F17*(1+Input!$B$24/100)","v":939.55},{"$f":"G17*(1+Input!$B$24/100)","v":6037.4999999999991},70.526903758950084,127.86745896720328,2692.8377206276123,12436.000747617014,57431.650414747659,"",20.227999999999998,39.878,59.528000000000006,79.177999999999997,576.48878080473003,"",{"$f":"'thermoplastic (90 mil)'!CA14","v":2500000},{"$f":"'thermoplastic (90 mil)'!CB14","v":5000000},{"$f":"'thermoplastic (90 mil)'!CC14","v":7500000},{"$f":"'thermoplastic (90 mil)'!CD14","v":10000000},{"$f":"'thermoplastic (90 mil)'!CE14","v":12500000},{"$f":"'thermoplastic (90 mil)'!CF14","v":0},null,1,1,1,0.89095327621796228,0.11768562925434416,{"$error":"#VALUE!"},null,null,null,null,null,null,null,null,null,null,1,{"$f":"Y11/(Y17+(Y17-Y11)*S17/($J11+$K11))","v":1},1,0.96667463212715532,0.6138607355652782,{"$error":"#VALUE!"}]
[null,"Tape","PCC","Yellow Edge","tape",{"$f":"Input!$B21","v":8108},{"$f":"Input!$D21","v":5250},{"$f":"F18*(1-Input!$B$23/100)","v":6891.8},{"$f":"G18*(1-Input!$B$23/100)","v":4462.5},{"$f":"F18*(1+Input!$B$24/100)","v":9324.1999999999989},{"$f":"G18*(1+Input!$B$24/100)","v":6037.4999999999991},70.526903758950084,127.86745896720328,2692.8377206276123,12436.000747617014,57431.650414747659,"",20.227999999999998,39.878,59.528000000000006,79.177999999999997,576.48878080473003,"",{"$f":"tape!CA9","v":2500000},{"$f":"tape!CB9","v":5000000},{"$f":"tape!CC9","v":7500000},{"$f":"tape!CD9","v":10000000},{"$f":"tape!CE9","v":12500000},{"$f":"tape!CF9","v":0},null,{"$f":"X6/(X18+(X18-X6)*L18/($H6+$I6))","v":1},{"$f":"Y6/(Y18+(Y18-Y6)*M18/($H6+$I6))","v":0.99386800998304314},0.95838208896766963,0.83389950951233138,0.47101390048704794,{"$error":"#VALUE!"},null,null,null,null,null,null,null,null,null,null,{"$f":"X6/(X18+(X18-X6)*R18/($J6+$K6))","v":1},{"$f":"Y6/(Y18+(Y18-Y6)*S18/($J6+$K6))","v":0.99397757531035213},0.9717080098619012,0.94291935103835567,0.90640791331108095,{"$error":"#VALUE!"}]
[null,null,null,"White Edge","tape",{"$f":"Input!$B21","v":8108},{"$f":"Input!$D21","v":5250},{"$f":"F19*(1-Input!$B$23/100)","v":6891.8},{"$f":"G19*(1-Input!$B$23/100)","v":4462.5},{"$f":"F19*(1+Input!$B$24/100)","v":9324.1999999999989},{"$f":"G19*(1+Input!$B$24/100)","v":6037.4999999999991},70.526903758950084,127.86745896720328,2692.8377206276123,12436.000747617014,57431.650414747659,"",20.227999999999998,39.878,59.528000000000006,79.177999999999997,576.48878080473003,"",{"$f":"tape!CA10","v":2500000},{"$f":"tape!CB10","v":5000000},{"$f":"tape!CC10","v":7500000},{"$f":"tape!CD10","v":10000000},{"$f":"tape!CE10","v":12500000},{"$f":"tape!CF10","v":0},null,{"$f":"X7/(X19+(X19-X7)*L19/($H7+$I7))","v":1},1,1,1,1,{"$error":"#VALUE!"},null,null,null,null,null,null,null,null,null,null,1,{"$f":"Y7/(Y19+(Y19-Y7)*S19/($J7+$K7))","v":1},1,1,1,{"$error":"#VALUE!"}]
[null,null,null,"White Lane","tape",{"$f":"Input!$C21","v":3861},{"$f":"Input!$E21","v":5250},{"$f":"F20*(1-Input!$B$23/100)","v":3281.85},{"$f":"G20*(1-Input!$B$23/100)","v":4462.5},{"$f":"F20*(1+Input!$B$24/100)","v":4440.1499999999996},{"$f":"G20*(1+Input!$B$24/100)","v":6037.4999999999991},70.526903758950084,127.86745896720328,2692.8377206276123,12436.000747617014,57431.650414747659,"",20.227999999999998,39.878,59.528000000000006,79.177999999999997,576.48878080473003,"",{"$f":"tape!CA11","v":2500000},{"$f":"tape!CB11","v":5000000},{"$f":"tape!CC11","v":7500000},{"$f":"tape!CD11","v":10000000},{"$f":"tape!CE11","v":12500000},{"$f":"tape!CF11","v":0},null,1,1,1,1,1,{"$error":"#VALUE!"},null,null,null,null,null,null,null,null,null,null,1,{"$f":"Y8/(Y20+(Y20-Y8)*S20/($J8+$K8))","v":1},1,1,1,{"$error":"#VALUE!"}]
[null,null,"AC","Yellow Edge","tape",{"$f":"Input!$B21","v":8108},{"$f":"Input!$D21","v":5250},{"$f":"F21*(1-Input!$B$23/100)","v":6891.8},{"$f":"G21*(1-Input!$B$23/100)","v":4462.5},{"$f":"F21*(1+Input!$B$24/100)","v":9324.1999999999989},{"$f":"G21*(1+Input!$B$24/100)","v":6037.4999999999991},70.526903758950084,127.86745896720328,2692.8377206276123,12436.000747617014,57431.650414747659,"",20.227999999999998,39.878,59.528000000000006,79.177999999999997,576.48878080473003,"",{"$f":"tape!CA12","v":2500000},{"$f":"tape!CB12","v":5000000},{"$f":"tape!CC12","v":7500000},{"$f":"tape!CD12","v":10000000},{"$f":"tape!CE12","v":12500000},{"$f":"tape!CF12","v":0},null,1,0.88392126843319141,0.45595686849630079,0.10753366270836925,5.5945259316757655E-3,{"$error":"#VALUE!"},null,null,null,null,null,null,null,null,null,null,1,{"$f":"Y9/(Y21+(Y21-Y9)*S21/($J9+$K9))","v":0.88576955163238247},0.55555230973592507,0.2839017408445671,5.7663486595376338E-2,{"$error":"#VALUE!"}]
[null,null,null,"White Edge","tape",{"$f":"Input!$B21","v":8108},{"$f":"Input!$D21","v":5250},{"$f":"F22*(1-Input!$B$23/100)","v":6891.8},{"$f":"G22*(1-Input!$B$23/100)","v":4462.5},{"$f":"F22*(1+Input!$B$24/100)","v":9324.1999999999989},{"$f":"G22*(1+Input!$B$24/100)","v":6037.4999999999991},70.526903758950084,127.86745896720328,2692.8377206276123,12436.000747617014,57431.650414747659,"",20.227999999999998,39.878,59.528000000000006,79.177999999999997,576.48878080473003,"",{"$f":"tape!CA13","v":2500000},{"$f":"tape!CB13","v":5000000},{"$f":"tape!CC13","v":7500000},{"$f":"tape!CD13","v":10000000},{"$f":"tape!CE13","v":12500000},{"$f":"tape!CF13","v":0},null,1,1,1,0.89823729632280092,0.12846456909699536,{"$error":"#VALUE!"},null,null,null,null,null,null,null,null,null,null,1,{"$f":"Y10/(Y22+(Y22-Y10)*S22/($J10+$K10))","v":1},1,0.96671465871987117,0.6158605150765728,{"$error":"#VALUE!"}]
[null,null,null,"White Lane","tape",{"$f":"Input!$C21","v":3861},{"$f":"Input!$E21","v":5250},{"$f":"F23*(1-Input!$B$23/100)","v":3281.85},{"$f":"G23*(1-Input!$B$23/100)","v":4462.5},{"$f":"F23*(1+Input!$B$24/100)","v":4440.1499999999996},{"$f":"G23*(1+Input!$B$24/100)","v":6037.4999999999991},70.526903758950084,127.86745896720328,2692.8377206276123,12436.000747617014,57431.650414747659,"",20.227999999999998,39.878,59.528000000000006,79.177999999999997,576.48878080473003,"",{"$f":"tape!CA14","v":2500000},{"$f":"tape!CB14","v":5000000},{"$f":"tape!CC14","v":7500000},{"$f":"tape!CD14","v":10000000},{"$f":"tape!CE14","v":12500000},{"$f":"tape!CF14","v":0},null,1,1,1,0.89095327621796228,0.11768562925434416,{"$error":"#VALUE!"},null,null,null,null,null,null,null,null,null,null,1,{"$f":"Y11/(Y23+(Y23-Y11)*S23/($J11+$K11))","v":1},1,0.96667463212715532,0.6138607355652782,{"$error":"#VALUE!"}]
[null,"Inverted","PCC","Yellow Edge","inverted",{"$f":"Input!$B22","v":5270},{"$f":"Input!$D22","v":5250},{"$f":"F24*(1-Input!$B$23/100)","v":4479.5},{"$f":"G24*(1-Input!$B$23/100)","v":4462.5},{"$f":"F24*(1+Input!$B$24/100)","v":6060.4999999999991},{"$f":"G24*(1+Input!$B$24/100)","v":6037.4999999999991},70.526903758950084,127.86745896720328,2692.8377206276123,12436.000747617014,57431.650414747659,"",20.227999999999998,39.878,59.528000000000006,79.177999999999997,576.48878080473003,"",{"$f":"inverted!CA9","v":2500000},{"$f":"inverted!CB9","v":5000000},{"$f":"inverted!CC9","v":7500000},{"$f":"inverted!CD9","v":10000000},{"$f":"inverted!CE9","v":12500000},{"$f":"inverted!CF9","v":0},null,{"$f":"X6/(X24+(X24-X6)*L24/($H6+$I6))","v":1},{"$f":"Y6/(Y24+(Y24-Y6)*M24/($H6+$I6))","v":0.99386800998304314},0.95838208896766963,0.83389950951233138,0.47101390048704794,{"$error":"#VALUE!"},null,null,null,null,null,null,null,null,null,null,{"$f":"X6/(X24+(X24-X6)*R24/($J6+$K6))","v":1},{"$f":"Y6/(Y24+(Y24-Y6)*S24/($J6+$K6))","v":0.99397757531035213},0.9717080098619012,0.94291935103835567,0.90640791331108095,{"$error":"#VALUE!"}]
[null,null,null,"White Edge","inverted",{"$f":"Input!$B22","v":5270},{"$f":"Input!$D22","v":5250},{"$f":"F25*(1-Input!$B$23/100)","v":4479.5},{"$f":"G25*(1-Input!$B$23/100)","v":4462.5},{"$f":"F25*(1+Input!$B$24/100)","v":6060.4999999999991},{"$f":"G25*(1+Input!$B$24/100)","v":6037.4999999999991},70.526903758950084,127.86745896720328,2692.8377206276123,12436.000747617014,57431.650414747659,"",20.227999999999998,39.878,59.528000000000006,79.177999999999997,576.48878080473003,"",{"$f":"inverted!CA10","v":2500000},{"$f":"inverted!CB10","v":5000000},{"$f":"inverted!CC10","v":7500000},{"$f":"inverted!CD10","v":8104940.3426599838},{"$f":"inverted!CE10","v":5266744.0752656925},{"$f":"inverted!CF10","v":0},null,{"$f":"X7/(X25+(X25-X7)*L25/($H7+$I7))","v":1},1,1,2.7053964819847276,-0.17254556194212753,{"$error":"#VALUE!"},null,null,null,null,null,null,null,null,null,null,{"$f":"X7/(X25+(X25-X7)*R25/($J7+$K7))","v":1},{"$f":"Y7/(Y25+(Y25-Y7)*S25/($J7+$K7))","v":1},1,1.2369817424068525,2.6651411634995319,{"$error":"#VALUE!"}]
[null,null,null,"White Lane","inverted",{"$f":"Input!$C22","v":2505},{"$f":"Input!$E22","v":5250},{"$f":"F26*(1-Input!$B$23/100)","v":2129.25},{"$f":"G26*(1-Input!$B$23/100)","v":4462.5},{"$f":"F26*(1+Input!$B$24/100)","v":2880.75},{"$f":"G26*(1+Input!$B$24/100)","v":6037.4999999999991},70.526903758950084,127.86745896720328,2692.8377206276123,12436.000747617014,57431.650414747659,"",20.227999999999998,39.878,59.528000000000006,79.177999999999997,576.48878080473003,"",{"$f":"inverted!CA11","v":2500000},{"$f":"inverted!CB11","v":5000000},{"$f":"inverted!CC11","v":7500000},{"$f":"inverted!CD11","v":8104940.3426599838},{"$f":"inverted!CE11","v":5266744.0752656925},{"$f":"inverted!CF11","v":0},null,1,1,1,3.1349113440053125,-0.15361626454632515,{"$error":"#VALUE!"},null,null,null,null,null,null,null,null,null,null,{"$f":"X8/(X26+(X26-X8)*R26/($J8+$K8))","v":1},{"$f":"Y8/(Y26+(Y26-Y8)*S26/($J8+$K8))","v":1},1,1.2373465144230784,2.7033154646467539,{"$error":"#VALUE!"}]
[null,null,"AC","Yellow Edge","inverted",null,null,null,null,null,null,null,null,null,null,null,null,null,null,null,null,null,null,{"$f":"inverted!CA12","v":0},{"$f":"inverted!CB12","v":0},{"$f":"inverted!CC12","v":0},{"$f":"inverted!CD12","v":0},{"$f":"inverted!CE12","v":0},{"$f":"inverted!CF12","v":0}]
[null,null,null,"White Edge","inverted",null,null,null,null,null,null,null,null,null,null,null,null,null,null,null,null,null,null,{"$f":"inverted!CA13","v":0},{"$f":"inverted!CB13","v":0},{"$f":"inverted!CC13","v":0},{"$f":"inverted!CD13","v":0},{"$f":"inverted!CE13","v":0},{"$f":"inverted!CF13","v":0}]
[null,null,null,"White Lane","inverted",null,null,null,null,null,null,null,null,null,null,null,null,null,null,null,null,null,null,{"$f":"inverted!CA14","v":0},{"$f":"inverted!CB14","v":0},{"$f":"inverted!CC14","v":0},{"$f":"inverted!CD14","v":0},{"$f":"inverted!CE14","v":0},{"$f":"inverted!CF14","v":0}]
[null,null,null,null,null,null,null,null,null,null,null,null,null,null,null,null,null,null,null,null,null,null,null,null,null,null,null,null,null,"90 mil",{"$f":"X12/(X6+(X6-X12)*L6/($H12+$I12))","v":1},{"$f":"Y12/(Y6+(Y6-Y12)*M6/($H12+$I12))","v":1.0061440115879521},1.0412365701171009,1.1957938660380694,6.7756843585138995,{"$error":"#VALUE!"},null,null,null,5000,10000,15000,20000,25000,{"$f":"IF(Input!$B$33=\"No\",\"\",Input!$B$33)","v":""},"90 mil",{"$f":"X12/(X6+(X6-X12)*R6/($J12+$K12))","v":1},{"$f":"Y12/(Y6+(Y6-Y12)*S6/($J12+$K12))","v":1.0060529616507945},1.0290776139465201,1.0604477355372266,1.1024901457870917,{"$error":"#VALUE!"}]
[null,null,null,null,null,null,null,null,null,null,null,null,null,null,null,null,null,null,null,null,"Finding Min Benefit/Cost","PCC","Yellow Edge",{"$f":"MIN(Results!E6,Results!E12,Results!E18,Results!E24)","v":218.82169603615264},{"$f":"MIN(Results!F6,Results!F12,Results!F18,Results!F24)","v":435.45785391722018},{"$f":"MIN(Results!G6,Results!G12,Results!G18,Results!G24)","v":533.91659917924596},{"$f":"MIN(Results!H6,Results!H12,Results!H18,Results!H24)","v":420.33936880775514},{"$f":"MIN(Results!I6,Results!I12,Results!I18,Results!I24)","v":181.72315603158413},{"$f":"MIN(Results!J6,Results!J12,Results!J18,Results!J24)","v":0},null,{"$f":"X13/(X7+(X7-X13)*L7/($H13+$I13))","v":1},1,1,1,1,{"$error":"#VALUE!"},"Finding Min Benefit/Cost","PCC","Yellow Edge",{"$f":"MIN(Results!L6,Results!L12,Results!L18,Results!L24)","v":162.52839045924546},{"$f":"MIN(Results!M6,Results!M12,Results!M18,Results!M24)","v":324.64205940456236},{"$f":"MIN(Results!N6,Results!N12,Results!N18,Results!N24)","v":486.34259217229658},{"$f":"MIN(Results!O6,Results!O12,Results!O18,Results!O24)","v":647.63156602882304},{"$f":"MIN(Results!P6,Results!P12,Results!P18,Results!P24)","v":784.27983078318562},{"$f":"MIN(Results!Q6,Results!Q12,Results!Q18,Results!Q24)","v":0},null,1,{"$f":"Y13/(Y7+(Y7-Y13)*S7/($J13+$K13))","v":1},1,1,1,{"$error":"#VALUE!"}]
[null,null,null,null,null,null,null,null,null,null,null,null,null,null,null,null,null,null,null,null,null,null,"White Edge",{"$f":"MIN(Results!E7,Results!E13,Results!E19,Results!E25)","v":218.82169603615264},{"$f":"MIN(Results!F7,Results!F13,Results!F19,Results!F25)","v":435.45785391722018},{"$f":"MIN(Results!G7,Results!G13,Results!G19,Results!G25)","v":533.91659917924596},{"$f":"MIN(Results!H7,Results!H13,Results!H19,Results!H25)","v":379.12527173821127},{"$f":"MIN(Results!I7,Results!I13,Results!I19,Results!I25)","v":79.349923386095213},{"$f":"MIN(Results!J7,Results!J13,Results!J19,Results!J25)","v":0},null,1,1,1,1,1,{"$error":"#VALUE!"},null,null,"White Edge",{"$f":"MIN(Results!L7,Results!L13,Results!L19,Results!L25)","v":162.52839045924546},{"$f":"MIN(Results!M7,Results!M13,Results!M19,Results!M25)","v":324.64205940456236},{"$f":"MIN(Results!N7,Results!N13,Results!N19,Results!N25)","v":486.34259217229658},{"$f":"MIN(Results!O7,Results!O13,Results!O19,Results!O25)","v":647.63156602882304},{"$f":"MIN(Results!P7,Results!P13,Results!P19,Results!P25)","v":415.53897489278432},{"$f":"MIN(Results!Q7,Results!Q13,Results!Q19,Results!Q25)","v":0},null,1,{"$f":"Y14/(Y8+(Y8-Y14)*S8/($J14+$K14))","v":1},1,1,1,{"$error":"#VALUE!"}]
[null,null,null,null,null,null,null,null,null,null,null,null,null,null,null,null,null,null,null,null,null,null,"White Lane",{"$f":"MIN(Results!E8,Results!E14,Results!E20,Results!E26)","v":319.9026716335739},{"$f":"MIN(Results!F8,Results!F14,Results!F20,Results!F26)","v":635.14505614990674},{"$f":"MIN(Results!G8,Results!G14,Results!G20,Results!G26)","v":718.58437356428124},{"$f":"MIN(Results!H8,Results!H14,Results!H20,Results!H26)","v":425.95367419741007},{"$f":"MIN(Results!I8,Results!I14,Results!I20,Results!I26)","v":82.262798307296862},{"$f":"MIN(Results!J8,Results!J14,Results!J20,Results!J26)","v":0},null,1,1.1310858227081071,2.6614460210225284,-0.9355436258305565,-0.12254079109571082,{"$error":"#VALUE!"},null,null,"White Lane",{"$f":"MIN(Results!L8,Results!L14,Results!L20,Results!L26)","v":238.14336573543721},{"$f":"MIN(Results!M8,Results!M14,Results!M20,Results!M26)","v":475.39688033157609},{"$f":"MIN(Results!N8,Results!N14,Results!N20,Results!N26)","v":711.76552204015161},{"$f":"MIN(Results!O8,Results!O14,Results!O20,Results!O26)","v":900.8063574012466},{"$f":"MIN(Results!P8,Results!P14,Results!P20,Results!P26)","v":554.70131373317338},{"$f":"MIN(Results!Q8,Results!Q14,Results!Q20,Results!Q26)","v":0},null,1,{"$f":"Y15/(Y9+(Y9-Y15)*S9/($J15+$K15))","v":1.1289060044423203},1.8030875769112353,3.5746977595998626,1031.0055254434317,{"$error":"#VALUE!"}]
[null,null,null,null,null,null,null,null,null,null,null,null,null,null,null,null,null,null,null,null,null,"AC","Yellow Edge",{"$f":"MIN(Results!E9,Results!E15,Results!E21)","v":218.82169603615264},{"$f":"MIN(Results!F9,Results!F15,Results!F21)","v":435.45785391722018},{"$f":"MIN(Results!G9,Results!G15,Results!G21)","v":520.22411753316658},{"$f":"MIN(Results!H9,Results!H15,Results!H21)","v":160.90774938592816},{"$f":"MIN(Results!I9,Results!I15,Results!I21)","v":12.340242790770578},{"$f":"MIN(Results!J9,Results!J15,Results!J21)","v":0},null,1,1,1,1.105527179679642,-0.38821652517666783,{"$error":"#VALUE!"},null,"AC","Yellow Edge",{"$f":"MIN(Results!L9,Results!L15,Results!L21)","v":162.52839045924546},{"$f":"MIN(Results!M9,Results!M15,Results!M21)","v":324.64205940456236},{"$f":"MIN(Results!N9,Results!N15,Results!N21)","v":486.34259217229658},{"$f":"MIN(Results!O9,Results!O15,Results!O21)","v":391.3279689506299},{"$f":"MIN(Results!P9,Results!P15,Results!P21)","v":99.206444211836356},{"$f":"MIN(Results!Q9,Results!Q15,Results!Q21)","v":0},null,1,{"$f":"Y16/(Y10+(Y10-Y16)*S10/($J16+$K16))","v":1},1,1.0343732170599789,1.6392856090469499,{"$error":"#VALUE!"}]
[null,null,null,null,null,null,null,null,null,null,null,null,null,null,null,null,null,null,null,null,null,null,"White Edge",{"$f":"MIN(Results!E10,Results!E16,Results!E22)","v":218.82169603615264},{"$f":"MIN(Results!F10,Results!F16,Results!F22)","v":435.45785391722018},{"$f":"MIN(Results!G10,Results!G16,Results!G22)","v":533.91659917924596},{"$f":"MIN(Results!H10,Results!H16,Results!H22)","v":420.33936880775514},{"$f":"MIN(Results!I10,Results!I16,Results!I22)","v":126.20715499461512},{"$f":"MIN(Results!J10,Results!J16,Results!J22)","v":0},null,1,1,1,1.1265877444708154,-0.29035621924275762,{"$error":"#VALUE!"},null,null,"White Edge",{"$f":"MIN(Results!L10,Results!L16,Results!L22)","v":162.52839045924546},{"$f":"MIN(Results!M10,Results!M16,Results!M22)","v":324.64205940456236},{"$f":"MIN(Results!N10,Results!N16,Results!N22)","v":486.34259217229658},{"$f":"MIN(Results!O10,Results!O16,Results!O22)","v":647.63156602882304},{"$f":"MIN(Results!P10,Results!P16,Results!P22)","v":784.27983078318562},{"$f":"MIN(Results!Q10,Results!Q16,Results!Q22)","v":0},null,1,{"$f":"Y17/(Y11+(Y11-Y17)*S11/($J17+$K17))","v":1},1,1.0344583643289107,1.6567792960462655,{"$error":"#VALUE!"}]
[null,null,null,null,null,null,null,null,null,null,null,null,null,null,null,null,null,null,null,null,null,null,"White Lane",{"$f":"MIN(Results!E11,Results!E17,Results!E23)","v":319.9026716335739},{"$f":"MIN(Results!F11,Results!F17,Results!F23)","v":635.14505614990674},{"$f":"MIN(Results!G11,Results!G17,Results!G23)","v":718.58437356428124},{"$f":"MIN(Results!H11,Results!H17,Results!H23)","v":495.53152594143319},{"$f":"MIN(Results!I11,Results!I17,Results!I23)","v":127.32428195029652},{"$f":"MIN(Results!J11,Results!J17,Results!J23)","v":0},null,1,1,1,1,1,1,null,null,"White Lane",{"$f":"MIN(Results!L11,Results!L17,Results!L23)","v":238.14336573543721},{"$f":"MIN(Results!M11,Results!M17,Results!M23)","v":475.39688033157609},{"$f":"MIN(Results!N11,Results!N17,Results!N23)","v":711.76552204015161},{"$f":"MIN(Results!O11,Results!O17,Results!O23)","v":947.25423204773267},{"$f":"MIN(Results!P11,Results!P17,Results!P23)","v":1121.6519883658248},{"$f":"MIN(Results!Q11,Results!Q17,Results!Q23)","v":0},null,1,1,1,1,1,1]
[null,null,null,null,null,null,null,null,null,null,null,null,null,null,null,null,null,null,null,null,"found min Benefit/Cost","PCC","Yellow Edge",{"$f":"IF(X31=Results!E6,\"40 mil\",IF(X31=Results!E12,\"90 mil\",IF(X31=Results!E18,\"Tape\",\"Inverted\")))","v":"Tape"},{"$f":"IF(Y31=Results!F6,\"40 mil\",IF(Y31=Results!F12,\"90 mil\",IF(Y31=Results!F18,\"Tape\",\"Inverted\")))","v":"Tape"},{"$f":"IF(Z31=Results!G6,\"40 mil\",IF(Z31=Results!G12,\"90 mil\",IF(Z31=Results!G18,\"Tape\",\"Inverted\")))","v":"Tape"},{"$f":"IF(AA31=Results!H6,\"40 mil\",IF(AA31=Results!H12,\"90 mil\",IF(AA31=Results!H18,\"Tape\",\"Inverted\")))","v":"Tape"},{"$f":"IF(AB31=Results!I6,\"40 mil\",IF(AB31=Results!I12,\"90 mil\",IF(AB31=Results!I18,\"Tape\",\"Inverted\")))","v":"Tape"},{"$f":"IF(AC31=Results!J6,\"40 mil\",IF(AC31=Results!J12,\"90 mil\",IF(AC31=Results!J18,\"Tape\",\"Inverted\")))","v":"40 mil"},null,1,1,1,1,1,1,"found min Benefit/Cost","PCC","Yellow Edge",{"$f":"IF(AN31=Results!L6,\"40 mil\",IF(AN31=Results!L12,\"90 mil\",IF(AN31=Results!L18,\"Tape\",\"Inverted\")))","v":"Tape"},{"$f":"IF(AO31=Results!M6,\"40 mil\",IF(AO31=Results!M12,\"90 mil\",IF(AO31=Results!M18,\"Tape\",\"Inverted\")))","v":"Tape"},{"$f":"IF(AP31=Results!N6,\"40 mil\",IF(AP31=Results!N12,\"90 mil\",IF(AP31=Results!N18,\"Tape\",\"Inverted\")))","v":"Tape"},{"$f":"IF(AQ31=Results!O6,\"40 mil\",IF(AQ31=Results!O12,\"90 mil\",IF(AQ31=Results!O18,\"Tape\",\"Inverted\")))","v":"Tape"},{"$f":"IF(AR31=Results!P6,\"40 mil\",IF(AR31=Results!P12,\"90 mil\",IF(AR31=Results!P18,\"Tape\",\"Inverted\")))","v":"Tape"},{"$f":"IF(AS31=Results!Q6,\"40 mil\",IF(AS31=Results!Q12,\"90 mil\",IF(AS31=Results!Q18,\"Tape\",\"Inverted\")))","v":"40 mil"},null,1,1,1,1,1,1]
[null,null,null,null,null,null,null,null,null,null,null,null,null,null,null,null,null,null,null,null,null,null,"White Edge",{"$f":"IF(X32=Results!E7,\"40 mil\",IF(X32=Results!E13,\"90 mil\",IF(X32=Results!E19,\"Tape\",\"Inverted\")))","v":"Tape"},{"$f":"IF(Y32=Results!F7,\"40 mil\",IF(Y32=Results!F13,\"90 mil\",IF(Y32=Results!F19,\"Tape\",\"Inverted\")))","v":"Tape"},{"$f":"IF(Z32=Results!G7,\"40 mil\",IF(Z32=Results!G13,\"90 mil\",IF(Z32=Results!G19,\"Tape\",\"Inverted\")))","v":"Tape"},{"$f":"IF(AA32=Results!H7,\"40 mil\",IF(AA32=Results!H13,\"90 mil\",IF(AA32=Results!H19,\"Tape\",\"Inverted\")))","v":"Inverted"},{"$f":"IF(AB32=Results!I7,\"40 mil\",IF(AB32=Results!I13,\"90 mil\",IF(AB32=Results!I19,\"Tape\",\"Inverted\")))","v":"Inverted"},{"$f":"IF(AC32=Results!J7,\"40 mil\",IF(AC32=Results!J13,\"90 mil\",IF(AC32=Results!J19,\"Tape\",\"Inverted\")))","v":"40 mil"},null,1,1,1,1,1,1,null,null,"White Edge",{"$f":"IF(AN32=Results!L7,\"40 mil\",IF(AN32=Results!L13,\"90 mil\",IF(AN32=Results!L19,\"Tape\",\"Inverted\")))","v":"Tape"},{"$f":"IF(AO32=Results!M7,\"40 mil\",IF(AO32=Results!M13,\"90 mil\",IF(AO32=Results!M19,\"Tape\",\"Inverted\")))","v":"Tape"},{"$f":"IF(AP32=Results!N7,\"40 mil\",IF(AP32=Results!N13,\"90 mil\",IF(AP32=Results!N19,\"Tape\",\"Inverted\")))","v":"Tape"},{"$f":"IF(AQ32=Results!O7,\"40 mil\",IF(AQ32=Results!O13,\"90 mil\",IF(AQ32=Results!O19,\"Tape\",\"Inverted\")))","v":"Tape"},{"$f":"IF(AR32=Results!P7,\"40 mil\",IF(AR32=Results!P13,\"90 mil\",IF(AR32=Results!P19,\"Tape\",\"Inverted\")))","v":"Inverted"},{"$f":"IF(AS32=Results!Q7,\"40 mil\",IF(AS32=Results!Q13,\"90 mil\",IF(AS32=Results!Q19,\"Tape\",\"Inverted\")))","v":"40 mil"},null,1,1,1,1,1,1]
[null,null,null,null,null,null,null,null,null,null,null,null,null,null,null,null,null,null,null,null,null,null,"White Lane",{"$f":"IF(X33=Results!E8,\"40 mil\",IF(X33=Results!E14,\"90 mil\",IF(X33=Results!E20,\"Tape\",\"Inverted\")))","v":"Tape"},{"$f":"IF(Y33=Results!F8,\"40 mil\",IF(Y33=Results!F14,\"90 mil\",IF(Y33=Results!F20,\"Tape\",\"Inverted\")))","v":"Tape"},{"$f":"IF(Z33=Results!G8,\"40 mil\",IF(Z33=Results!G14,\"90 mil\",IF(Z33=Results!G20,\"Tape\",\"Inverted\")))","v":"Tape"},{"$f":"IF(AA33=Results!H8,\"40 mil\",IF(AA33=Results!H14,\"90 mil\",IF(AA33=Results!H20,\"Tape\",\"Inverted\")))","v":"Inverted"},{"$f":"IF(AB33=Results!I8,\"40 mil\",IF(AB33=Results!I14,\"90 mil\",IF(AB33=Results!I20,\"Tape\",\"Inverted\")))","v":"Inverted"},{"$f":"IF(AC33=Results!J8,\"40 mil\",IF(AC33=Results!J14,\"90 mil\",IF(AC33=Results!J20,\"Tape\",\"Inverted\")))","v":"40 mil"},null,1,1,1,1,1,1,null,null,"White Lane",{"$f":"IF(AN33=Results!L8,\"40 mil\",IF(AN33=Results!L14,\"90 mil\",IF(AN33=Results!L20,\"Tape\",\"Inverted\")))","v":"Tape"},{"$f":"IF(AO33=Results!M8,\"40 mil\",IF(AO33=Results!M14,\"90 mil\",IF(AO33=Results!M20,\"Tape\",\"Inverted\")))","v":"Tape"},{"$f":"IF(AP33=Results!N8,\"40 mil\",IF(AP33=Results!N14,\"90 mil\",IF(AP33=Results!N20,\"Tape\",\"Inverted\")))","v":"Tape"},{"$f":"IF(AQ33=Results!O8,\"40 mil\",IF(AQ33=Results!O14,\"90 mil\",IF(AQ33=Results!O20,\"Tape\",\"Inverted\")))","v":"Inverted"},{"$f":"IF(AR33=Results!P8,\"40 mil\",IF(AR33=Results!P14,\"90 mil\",IF(AR33=Results!P20,\"Tape\",\"Inverted\")))","v":"Inverted"},{"$f":"IF(AS33=Results!Q8,\"40 mil\",IF(AS33=Results!Q14,\"90 mil\",IF(AS33=Results!Q20,\"Tape\",\"Inverted\")))","v":"40 mil"},null,1,1,1,1,1,1]
[null,null,null,null,null,null,null,null,null,null,null,null,null,null,null,null,null,null,null,null,null,"AC","Yellow Edge",{"$f":"IF(X34=Results!E9,\"40 mil\",IF(X34=Results!E15,\"90 mil\",\"Tape\"))","v":"Tape"},{"$f":"IF(Y34=Results!F9,\"40 mil\",IF(Y34=Results!F15,\"90 mil\",\"Tape\"))","v":"Tape"},{"$f":"IF(Z34=Results!G9,\"40 mil\",IF(Z34=Results!G15,\"90 mil\",\"Tape\"))","v":"40 mil"},{"$f":"IF(AA34=Results!H9,\"40 mil\",IF(AA34=Results!H15,\"90 mil\",\"Tape\"))","v":"40 mil"},{"$f":"IF(AB34=Results!I9,\"40 mil\",IF(AB34=Results!I15,\"90 mil\",\"Tape\"))","v":"40 mil"},{"$f":"IF(AC34=Results!J9,\"40 mil\",IF(AC34=Results!J15,\"90 mil\",\"Tape\"))","v":"40 mil"},null,1,1,1,1,1,1,null,"AC","Yellow Edge",{"$f":"IF(AN34=Results!L9,\"40 mil\",IF(AN34=Results!L15,\"90 mil\",\"Tape\"))","v":"Tape"},{"$f":"IF(AO34=Results!M9,\"40 mil\",IF(AO34=Results!M15,\"90 mil\",\"Tape\"))","v":"Tape"},{"$f":"IF(AP34=Results!N9,\"40 mil\",IF(AP34=Results!N15,\"90 mil\",\"Tape\"))","v":"Tape"},{"$f":"IF(AQ34=Results!O9,\"40 mil\",IF(AQ34=Results!O15,\"90 mil\",\"Tape\"))","v":"40 mil"},{"$f":"IF(AR34=Results!P9,\"40 mil\",IF(AR34=Results!P15,\"90 mil\",\"Tape\"))","v":"40 mil"},{"$f":"IF(AS34=Results!Q9,\"40 mil\",IF(AS34=Results!Q15,\"90 mil\",\"Tape\"))","v":"40 mil"},null,1,1,1,1,1,1]
[null,null,null,null,null,null,null,null,null,null,null,null,null,null,null,null,null,null,null,null,null,null,"White Edge",{"$f":"IF(X35=Results!E10,\"40 mil\",IF(X35=Results!E16,\"90 mil\",\"Tape\"))","v":"Tape"},{"$f":"IF(Y35=Results!F10,\"40 mil\",IF(Y35=Results!F16,\"90 mil\",\"Tape\"))","v":"Tape"},{"$f":"IF(Z35=Results!G10,\"40 mil\",IF(Z35=Results!G16,\"90 mil\",\"Tape\"))","v":"Tape"},{"$f":"IF(AA35=Results!H10,\"40 mil\",IF(AA35=Results!H16,\"90 mil\",\"Tape\"))","v":"Tape"},{"$f":"IF(AB35=Results!I10,\"40 mil\",IF(AB35=Results!I16,\"90 mil\",\"Tape\"))","v":"40 mil"},{"$f":"IF(AC35=Results!J10,\"40 mil\",IF(AC35=Results!J16,\"90 mil\",\"Tape\"))","v":"40 mil"},null,1,1,1,1,1,1,null,null,"White Edge",{"$f":"IF(AN35=Results!L10,\"40 mil\",IF(AN35=Results!L16,\"90 mil\",\"Tape\"))","v":"Tape"},{"$f":"IF(AO35=Results!M10,\"40 mil\",IF(AO35=Results!M16,\"90 mil\",\"Tape\"))","v":"Tape"},{"$f":"IF(AP35=Results!N10,\"40 mil\",IF(AP35=Results!N16,\"90 mil\",\"Tape\"))","v":"Tape"},{"$f":"IF(AQ35=Results!O10,\"40 mil\",IF(AQ35=Results!O16,\"90 mil\",\"Tape\"))","v":"Tape"},{"$f":"IF(AR35=Results!P10,\"40 mil\",IF(AR35=Results!P16,\"90 mil\",\"Tape\"))","v":"Tape"},{"$f":"IF(AS35=Results!Q10,\"40 mil\",IF(AS35=Results!Q16,\"90 mil\",\"Tape\"))","v":"40 mil"},null,1,1,1,1,1,1]
[null,null,null,null,null,null,null,null,null,null,null,null,null,null,null,null,null,null,null,null,null,null,"White Lane",{"$f":"IF(X36=Results!E11,\"40 mil\",IF(X36=Results!E17,\"90 mil\",\"Tape\"))","v":"Tape"},{"$f":"IF(Y36=Results!F11,\"40 mil\",IF(Y36=Results!F17,\"90 mil\",\"Tape\"))","v":"Tape"},{"$f":"IF(Z36=Results!G11,\"40 mil\",IF(Z36=Results!G17,\"90 mil\",\"Tape\"))","v":"Tape"},{"$f":"IF(AA36=Results!H11,\"40 mil\",IF(AA36=Results!H17,\"90 mil\",\"Tape\"))","v":"Tape"},{"$f":"IF(AB36=Results!I11,\"40 mil\",IF(AB36=Results!I17,\"90 mil\",\"Tape\"))","v":"40 mil"},{"$f":"IF(AC36=Results!J11,\"40 mil\",IF(AC36=Results!J17,\"90 mil\",\"Tape\"))","v":"40 mil"},null,{"$f":"X12/(X18+(X18-X12)*L18/($H12+$I12))","v":1},{"$f":"Y12/(Y18+(Y18-Y12)*M18/($H12+$I12))","v":1},1,1,1,{"$error":"#VALUE!"},null,null,"White Lane",{"$f":"IF(AN36=Results!L11,\"40 mil\",IF(AN36=Results!L17,\"90 mil\",\"Tape\"))","v":"Tape"},{"$f":"IF(AO36=Results!M11,\"40 mil\",IF(AO36=Results!M17,\"90 mil\",\"Tape\"))","v":"Tape"},{"$f":"IF(AP36=Results!N11,\"40 mil\",IF(AP36=Results!N17,\"90 mil\",\"Tape\"))","v":"Tape"},{"$f":"IF(AQ36=Results!O11,\"40 mil\",IF(AQ36=Results!O17,\"90 mil\",\"Tape\"))","v":"Tape"},{"$f":"IF(AR36=Results!P11,\"40 mil\",IF(AR36=Results!P17,\"90 mil\",\"Tape\"))","v":"40 mil"},{"$f":"IF(AS36=Results!Q11,\"40 mil\",IF(AS36=Results!Q17,\"90 mil\",\"Tape\"))","v":"40 mil"},null,{"$f":"X12/(X18+(X18-X12)*R18/($J12+$K12))","v":1},{"$f":"Y12/(Y18+(Y18-Y12)*S18/($J12+$K12))","v":1},1,1,1,{"$error":"#VALUE!"}]
[null,null,null,null,null,null,null,null,null,null,null,null,null,null,null,null,null,null,null,null,null,null,null,null,null,null,null,null,null,null,{"$f":"X13/(X19+(X19-X13)*L19/($H13+$I13))","v":1},1,1,1,1,{"$error":"#VALUE!"},null,null,null,null,null,null,null,null,null,null,1,{"$f":"Y13/(Y19+(Y19-Y13)*S19/($J13+$K13))","v":1},1,1,1,{"$error":"#VALUE!"}]
[null,null,null,null,null,null,null,null,null,null,null,null,null,null,null,null,null,null,null,null,null,null,null,null,null,null,null,null,null,null,1,1,1,1,1,{"$error":"#VALUE!"},null,null,null,null,null,null,null,null,null,null,1,{"$f":"Y14/(Y20+(Y20-Y14)*S20/($J14+$K14))","v":1},1,1,1,{"$error":"#VALUE!"}]
[null,null,null,null,null,null,null,null,null,null,null,null,null,null,null,null,null,null,null,null,null,null,null,null,null,null,null,null,null,null,1,1,1,1,1,{"$error":"#VALUE!"},null,null,null,null,null,null,null,null,null,null,1,{"$f":"Y15/(Y21+(Y21-Y15)*S21/($J15+$K15))","v":1},1,1,1,{"$error":"#VALUE!"}]
[null,null,null,null,null,null,null,null,null,null,null,null,null,null,null,null,null,null,null,null,null,null,null,null,null,null,null,null,null,null,1,1,1,1,1,{"$error":"#VALUE!"},null,null,null,null,null,null,null,null,null,null,1,{"$f":"Y16/(Y22+(Y22-Y16)*S22/($J16+$K16))","v":1},1,1,1,{"$error":"#VALUE!"}]
[null,null,null,null,null,null,null,null,null,null,null,null,null,null,null,null,null,null,null,null,null,null,null,null,null,null,null,null,null,null,1,1,1,1,1,{"$error":"#VALUE!"},null,null,null,null,null,null,null,null,null,null,1,{"$f":"Y17/(Y23+(Y23-Y17)*S23/($J17+$K17))","v":1},1,1,1,{"$error":"#VALUE!"}]
[null,null,null,null,null,null,null,null,null,null,null,null,null,null,null,null,null,null,null,null,null,null,null,null,null,null,null,null,null,null,{"$f":"X12/(X24+(X24-X12)*L24/($H12+$I12))","v":1},{"$f":"Y12/(Y24+(Y24-Y12)*M24/($H12+$I12))","v":1},1,1,1,{"$error":"#VALUE!"},null,null,null,null,null,null,null,null,null,null,{"$f":"X12/(X24+(X24-X12)*R24/($J12+$K12))","v":1},{"$f":"Y12/(Y24+(Y24-Y12)*S24/($J12+$K12))","v":1},1,1,1,{"$error":"#VALUE!"}]
[null,null,null,null,null,null,null,null,null,null,null,null,null,null,null,null,null,null,null,null,null,null,null,null,null,null,null,null,null,null,{"$f":"X13/(X25+(X25-X13)*L25/($H13+$I13))","v":1},1,1,2.2183183907420805,-0.21500419537066273,{"$error":"#VALUE!"},null,null,null,null,null,null,null,null,null,null,{"$f":"X13/(X25+(X25-X13)*R25/($J13+$K13))","v":1},{"$f":"Y13/(Y25+(Y25-Y13)*S25/($J13+$K13))","v":1},1,1.2363976115948636,2.6061621395517394,{"$error":"#VALUE!"}]
[null,null,null,null,null,null,null,null,null,null,null,null,null,null,null,null,null,null,null,null,null,null,null,null,null,null,null,null,null,null,1,1,1,2.8288557828157059,-0.16602867091644127,{"$error":"#VALUE!"},null,null,null,null,null,null,null,null,null,null,{"$f":"X14/(X26+(X26-X14)*R26/($J14+$K14))","v":1},{"$f":"Y14/(Y26+(Y26-Y14)*S26/($J14+$K14))","v":1},1,1.2370979124957913,2.6771835507175323,{"$error":"#VALUE!"}]
[]
[]
[]
[null,null,null,null,null,null,null,null,null,null,null,null,null,null,null,null,null,null,null,null,null,null,null,null,null,null,null,null,null,"tape",{"$f":"X18/(X6+(X6-X18)*L6/($H18+$I18))","v":1},{"$f":"Y18/(Y6+(Y6-Y18)*M6/($H18+$I18))","v":1.0060939617391254},1.0359732670459338,1.1342720166585465,2.1221927786395787,{"$error":"#VALUE!"},null,null,null,null,null,null,null,null,null,"tape",{"$f":"X18/(X6+(X6-X18)*R6/($J18+$K18))","v":1},{"$f":"Y18/(Y6+(Y6-Y18)*S6/($J18+$K18))","v":1.0060414261830659},1.0289931924116547,1.0602077522704769,1.0995794092528457,{"$error":"#VALUE!"}]
[null,null,null,null,null,null,null,null,null,null,null,null,null,null,null,null,null,null,null,null,null,null,null,null,null,null,null,null,null,null,{"$f":"X19/(X7+(X7-X19)*L7/($H19+$I19))","v":1},1,1,1,1,{"$error":"#VALUE!"},null,null,null,null,null,null,null,null,null,null,1,{"$f":"Y19/(Y7+(Y7-Y19)*S7/($J19+$K19))","v":1},1,1,1,{"$error":"#VALUE!"}]
[null,null,null,null,null,null,null,null,null,null,null,null,null,null,null,null,null,null,null,null,null,null,null,null,null,null,null,null,null,null,1,1,1,1,1,{"$error":"#VALUE!"},null,null,null,null,null,null,null,null,null,null,1,{"$f":"Y20/(Y8+(Y8-Y20)*S8/($J20+$K20))","v":1},1,1,1,{"$error":"#VALUE!"}]
[null,null,null,null,null,null,null,null,null,null,null,null,null,null,null,null,null,null,null,null,null,null,null,null,null,null,null,null,null,null,1,1.1298865918902232,2.2092226376443871,-2.0170694761406729,-0.21355256257980709,{"$error":"#VALUE!"},null,null,null,null,null,null,null,null,null,null,1,{"$f":"Y21/(Y9+(Y9-Y21)*S9/($J21+$K21))","v":1.1286304062811516},1.7990111586273845,3.5405620905551065,37.350953515124566,{"$error":"#VALUE!"}]
[null,null,null,null,null,null,null,null,null,null,null,null,null,null,null,null,null,null,null,null,null,null,null,null,null,null,null,null,null,null,1,1,1,1.0741269357917684,-0.82083218464911711,{"$error":"#VALUE!"},null,null,null,null,null,null,null,null,null,null,1,{"$f":"Y22/(Y10+(Y10-Y22)*S10/($J22+$K22))","v":1},1,1.034240094549278,1.6126580471048042,{"$error":"#VALUE!"}]
[null,null,null,null,null,null,null,null,null,null,null,null,null,null,null,null,null,null,null,null,null,null,null,null,null,null,null,null,null,null,1,1,1,1.0938850159446407,-0.48039537693850898,{"$error":"#VALUE!"},null,null,null,null,null,null,null,null,null,null,1,{"$f":"Y23/(Y11+(Y11-Y23)*S11/($J23+$K23))","v":1},1,1.0343247472116042,1.6294901348078163,{"$error":"#VALUE!"}]
[null,null,null,null,null,null,null,null,null,null,null,null,null,null,null,null,null,null,null,null,null,null,null,null,null,null,null,null,null,null,{"$f":"X18/(X12+(X12-X18)*L12/($H18+$I18))","v":1},{"$f":"Y18/(Y12+(Y12-Y18)*M12/($H18+$I18))","v":1},1,1,1,{"$error":"#VALUE!"},null,null,null,null,null,null,null,null,null,null,{"$f":"X18/(X12+(X12-X18)*R12/($J18+$K18))","v":1},{"$f":"Y18/(Y12+(Y12-Y18)*S12/($J18+$K18))","v":1},1,1,1,{"$error":"#VALUE!"}]
[null,null,null,null,null,null,null,null,null,null,null,null,null,null,null,null,null,null,null,null,null,null,null,null,null,null,null,null,null,null,{"$f":"X19/(X13+(X13-X19)*L13/($H19+$I19))","v":1},1,1,1,1,{"$error":"#VALUE!"},null,null,null,null,null,null,null,null,null,null,1,{"$f":"Y19/(Y13+(Y13-Y19)*S13/($J19+$K19))","v":1},1,1,1,{"$error":"#VALUE!"}]
[null,null,null,null,null,null,null,null,null,null,null,null,null,null,null,null,null,null,null,null,null,null,null,null,null,null,null,null,null,null,1,1,1,1,1,{"$error":"#VALUE!"},null,null,null,null,null,null,null,null,null,null,1,{"$f":"Y20/(Y14+(Y14-Y20)*S14/($J20+$K20))","v":1},1,1,1,{"$error":"#VALUE!"}]
[null,null,null,null,null,null,null,null,null,null,null,null,null,null,null,null,null,null,null,null,null,null,null,null,null,null,null,null,null,null,1,1,1,1,1,{"$error":"#VALUE!"},null,null,null,null,null,null,null,null,null,null,1,{"$f":"Y21/(Y15+(Y15-Y21)*S15/($J21+$K21))","v":1},1,1,1,{"$error":"#VALUE!"}]
[null,null,null,null,null,null,null,null,null,null,null,null,null,null,null,null,null,null,null,null,null,null,null,null,null,null,{"$f":"(Y16*(H22+I22)+(Y16-Y22)*M16)/Y22/(H16+I16)","v":1.7330046704722366},null,null,null,1,1,1,1,1,{"$error":"#VALUE!"},null,null,null,null,null,null,null,null,null,null,1,{"$f":"Y22/(Y16+(Y16-Y22)*S16/($J22+$K22))","v":1},1,1,1,{"$error":"#VALUE!"}]
[null,null,null,null,null,null,null,null,null,null,null,null,null,null,null,null,null,null,null,null,null,null,null,null,null,null,null,null,null,null,1,1,1,1,1,{"$error":"#VALUE!"},null,null,null,null,null,null,null,null,null,null,1,{"$f":"Y23/(Y17+(Y17-Y23)*S17/($J23+$K23))","v":1},1,1,1,{"$error":"#VALUE!"}]
[null,null,null,null,null,null,null,null,null,null,null,null,null,null,null,null,null,null,null,null,null,null,null,null,null,null,null,null,null,null,1,1,1,1,1,1,null,null,null,null,null,null,null,null,null,null,1,1,1,1,1,1]
[null,null,null,null,null,null,null,null,null,null,null,null,null,null,null,null,null,null,null,null,null,null,null,null,null,null,null,null,null,null,1,1,1,1,1,1,null,null,null,null,null,null,null,null,null,null,1,1,1,1,1,1]
[null,null,null,null,null,null,null,null,null,null,null,null,null,null,null,null,null,null,null,null,null,null,null,null,null,null,null,null,null,null,1,1,1,1,1,1,null,null,null,null,null,null,null,null,null,null,1,1,1,1,1,1]
[null,null,null,null,null,null,null,null,null,null,null,null,null,null,null,null,null,null,null,null,null,null,null,null,null,null,null,null,null,null,1,1,1,1,1,1,null,null,null,null,null,null,null,null,null,null,1,1,1,1,1,1]
[null,null,null,null,null,null,null,null,null,null,null,null,null,null,null,null,null,null,null,null,null,null,null,null,null,null,null,null,null,null,1,1,1,1,1,1,null,null,null,null,null,null,null,null,null,null,1,1,1,1,1,1]
[null,null,null,null,null,null,null,null,null,null,null,null,null,null,null,null,null,null,null,null,null,null,null,null,null,null,null,null,null,null,1,1,1,1,1,1,null,null,null,null,null,null,null,null,null,null,1,1,1,1,1,1]
[null,null,null,null,null,null,null,null,null,null,null,null,null,null,null,null,null,null,null,null,null,null,null,null,null,null,null,null,null,null,{"$f":"X18/(X24+(X24-X18)*L24/($H18+$I18))","v":1},{"$f":"Y18/(Y24+(Y24-Y18)*M24/($H18+$I18))","v":1},1,1,1,{"$error":"#VALUE!"},null,null,null,null,null,null,null,null,null,null,{"$f":"X18/(X24+(X24-X18)*R24/($J18+$K18))","v":1},{"$f":"Y18/(Y24+(Y24-Y18)*S24/($J18+$K18))","v":1},1,1,1,{"$error":"#VALUE!"}]
[null,null,null,null,null,null,null,null,null,null,null,null,null,null,null,null,null,null,null,null,null,null,null,null,null,null,null,null,null,null,{"$f":"X19/(X25+(X25-X19)*L25/($H19+$I19))","v":1},1,1,1.6585557046823389,-0.39910492810111853,{"$error":"#VALUE!"},null,null,null,null,null,null,null,null,null,null,{"$f":"X19/(X25+(X25-X19)*R25/($J19+$K19))","v":1},{"$f":"Y19/(Y25+(Y25-Y19)*S25/($J19+$K19))","v":1},1,1.2353040911345419,2.5023537906403392,{"$error":"#VALUE!"}]
[null,null,null,null,null,null,null,null,null,null,null,null,null,null,null,null,null,null,null,null,null,null,null,null,null,null,null,null,null,null,1,1,1,1.9755727073185998,-0.25839973655821646,{"$error":"#VALUE!"},null,null,null,null,null,null,null,null,null,null,{"$f":"X20/(X26+(X26-X20)*R26/($J20+$K20))","v":1},{"$f":"Y20/(Y26+(Y26-Y20)*S26/($J20+$K20))","v":1},1,1.2359992698113995,2.5673864585508492,{"$error":"#VALUE!"}]
[]
[]
[]
[null,null,null,null,null,null,null,null,null,null,null,null,null,null,null,null,null,null,null,null,null,null,null,null,null,null,null,null,null,"Inverted",{"$f":"X24/(X6+(X6-X24)*L6/($H24+$I24))","v":1},{"$f":"Y24/(Y6+(Y6-Y24)*M6/($H24+$I24))","v":1.006112381289566},1.0379041507780515,1.1561638614608403,2.8400579366825509,{"$error":"#VALUE!"},null,null,null,null,null,null,null,null,null,"Inverted",{"$f":"X24/(X6+(X6-X24)*R6/($J24+$K24))","v":1},{"$f":"Y24/(Y6+(Y6-Y24)*S6/($J24+$K24))","v":1.006045671615867},1.0290242609367377,1.0602960620396664,1.1006488750112313,{"$error":"#VALUE!"}]
[null,null,null,null,null,null,null,null,null,null,null,null,null,null,null,null,null,null,null,null,null,null,null,null,null,null,null,null,null,null,{"$f":"X25/(X7+(X7-X25)*L7/($H25+$I25))","v":1},1,1,0.64144016634660161,8.9332068327693137E-2,{"$error":"#VALUE!"},null,null,null,null,null,null,null,null,null,null,{"$f":"X25/(X7+(X7-X25)*R7/($J25+$K25))","v":1},{"$f":"Y25/(Y7+(Y7-Y25)*S7/($J25+$K25))","v":1},1,0.80949005359787407,0.41003323505632872,{"$error":"#VALUE!"}]
[null,null,null,null,null,null,null,null,null,null,null,null,null,null,null,null,null,null,null,null,null,null,null,null,null,null,null,null,null,null,1,1,1,0.59703929066867578,6.973892135811785E-2,{"$error":"#VALUE!"},null,null,null,null,null,null,null,null,null,null,{"$f":"X26/(X8+(X8-X26)*R8/($J26+$K26))","v":1},{"$f":"Y26/(Y8+(Y8-Y26)*S8/($J26+$K26))","v":1},1,0.80913269140061472,0.40614739464444699,{"$error":"#VALUE!"}]
[]
[]
[]
[null,null,null,null,null,null,null,null,null,null,null,null,null,null,null,null,null,null,null,null,null,null,null,null,null,null,null,null,null,null,{"$f":"X24/(X12+(X12-X24)*L12/($H24+$I24))","v":1},{"$f":"Y24/(Y12+(Y12-Y24)*M12/($H24+$I24))","v":1},1,1,1,{"$error":"#VALUE!"},null,null,null,null,null,null,null,null,null,null,{"$f":"X24/(X12+(X12-X24)*R12/($J24+$K24))","v":1},{"$f":"Y24/(Y12+(Y12-Y24)*S12/($J24+$K24))","v":1},1,1,1,{"$error":"#VALUE!"}]
[null,null,null,null,null,null,null,null,null,null,null,null,null,null,null,null,null,null,null,null,null,null,null,null,null,null,null,null,null,null,{"$f":"X25/(X13+(X13-X25)*L13/($H25+$I25))","v":1},1,1,0.64144016634660161,8.9332068327693137E-2,{"$error":"#VALUE!"},null,null,null,null,null,null,null,null,null,null,{"$f":"X25/(X13+(X13-X25)*R13/($J25+$K25))","v":1},{"$f":"Y25/(Y13+(Y13-Y25)*S13/($J25+$K25))","v":1},1,0.80949005359787407,0.41003323505632872,{"$error":"#VALUE!"}]
[null,null,null,null,null,null,null,null,null,null,null,null,null,null,null,null,null,null,null,null,null,null,null,null,null,null,null,null,null,null,1,1,1,0.59703929066867578,6.973892135811785E-2,{"$error":"#VALUE!"},null,null,null,null,null,null,null,null,null,null,{"$f":"X26/(X14+(X14-X26)*R14/($J26+$K26))","v":1},{"$f":"Y26/(Y14+(Y14-Y26)*S14/($J26+$K26))","v":1},1,0.80913269140061472,0.40614739464444699,{"$error":"#VALUE!"}]
[]
[]
[]
[null,null,null,null,null,null,null,null,null,null,null,null,null,null,null,null,null,null,null,null,null,null,null,null,null,null,null,null,null,null,{"$f":"X24/(X18+(X18-X24)*L18/($H24+$I24))","v":1},{"$f":"Y24/(Y18+(Y18-Y24)*M18/($H24+$I24))","v":1},1,1,1,{"$error":"#VALUE!"},null,null,null,null,null,null,null,null,null,null,{"$f":"X24/(X18+(X18-X24)*R18/($J24+$K24))","v":1},{"$f":"Y24/(Y18+(Y18-Y24)*S18/($J24+$K24))","v":1},1,1,1,{"$error":"#VALUE!"}]
[null,null,null,null,null,null,null,null,null,null,null,null,null,null,null,null,null,null,null,null,null,null,null,null,null,null,null,null,null,null,{"$f":"X25/(X19+(X19-X25)*L19/($H25+$I25))","v":1},1,1,0.64144016634660161,8.9332068327693137E-2,{"$error":"#VALUE!"},null,null,null,null,null,null,null,null,null,null,{"$f":"X25/(X19+(X19-X25)*R19/($J25+$K25))","v":1},{"$f":"Y25/(Y19+(Y19-Y25)*S19/($J25+$K25))","v":1},1,0.80949005359787407,0.41003323505632872,{"$error":"#VALUE!"}]
[null,null,null,null,null,null,null,null,null,null,null,null,null,null,null,null,null,null,null,null,null,null,null,null,null,null,null,null,null,null,1,1,1,0.59703929066867578,6.973892135811785E-2,{"$error":"#VALUE!"},null,null,null,null,null,null,null,null,null,null,{"$f":"X26/(X20+(X20-X26)*R20/($J26+$K26))","v":1},{"$f":"Y26/(Y20+(Y20-Y26)*S20/($J26+$K26))","v":1},1,0.80913269140061472,0.40614739464444699,{"$error":"#VALUE!"}]
[]
[]
[]
[null,null,null,null,null,null,null,null,null,null,null,null,null,null,null,null,null,null,null,null,null,null,null,null,null,null,null,null,null,null,1,1,1,1,1,1,null,null,null,null,null,null,null,null,null,null,1,1,1,1,1,1]
[null,null,null,null,null,null,null,null,null,null,null,null,null,null,null,null,null,null,null,null,null,null,null,null,null,null,null,null,null,null,1,1,1,1,1,1,null,null,null,null,null,null,null,null,null,null,1,1,1,1,1,1]
[null,null,null,null,null,null,null,null,null,null,null,null,null,null,null,null,null,null,null,null,null,null,null,null,null,null,null,null,null,null,1,1,1,1,1,1,null,null,null,null,null,null,null,null,null,null,1,1,1,1,1,1]
[]
[]
[]
[]
[]
[]
[]
[]
[]
[]
[]
[]
["Calcluating Factors for New Stripe"]
[null,null,null,null,null,null,null,null,null,null,null,null,null,null,null,null,null,null,null,null,null,null,null,null,null,null,null,null,null,null,"Factors for New Stripe"]
[null,"Marking Type","Pavement Type","Line Type",null,"PM Costs",null,null,null,null,null,"User Cost",null,null,null,null,null,null,null,null,null,null,null,null,null,null,null,null,null,null,"Off-Peak Application",null,null,null,null,null,"Night Time Application"]
[null,null,null,null,null,"Average Costs",null,"Off-Peak Application",null,"Night Time Application",null,"Off-Peak Application",null,null,null,null,null,"Night Time Application",null,null,null,null,null,"Benefit",null,null,null,null,null,null,"Factors by Different References (40, 90, tape, and inverted)",null,null,null,null,null,null,null,null,null,null,null,null,null,null,null,"Factors by Different References (40, 90, tape, and inverted)"]
[null,null,null,null,null,"Application","Removal","Application","Removal","Application","Removal",5000,10000,15000,20000,25000,{"$f":"IF(Input!$B$33=\"No\",\"\",Input!$B$33)","v":""},5000,10000,15000,20000,25000,{"$f":"IF(Input!$B$33=\"No\",\"\",Input!$B$33)","v":""},5000,10000,15000,20000,25000,{"$f":"IF(Input!$B$33=\"No\",\"\",Input!$B$33)","v":""},null,5000,10000,15000,20000,25000,{"$f":"IF(Input!$B$33=\"No\",\"\",Input!$B$33)","v":""},null,null,null,null,null,null,null,null,null,null,5000,10000,15000,20000,25000,{"$f":"IF(Input!$B$33=\"No\",\"\",Input!$B$33)","v":""}]
[null,"Thermo (40 mil)","PCC","Yellow Edge","40 mil",{"$f":"Input!$B19","v":1039},{"$f":"Input!$D19","v":5250},{"$f":"F116*(1-Input!$B$23/100)","v":883.15},null,{"$f":"F116*(1+Input!$B$24/100)","v":1194.8499999999999},null,{"$f":"Input!C28","v":70.526903758950084},{"$f":"Input!C29","v":127.86745896720328},{"$f":"Input!C30","v":2692.8377206276123},{"$f":"Input!C31","v":12436.000747617014},{"$f":"Input!C32","v":57431.650414747659},{"$f":"Input!C33","v":""},{"$f":"Input!D28","v":20.227999999999998},{"$f":"Input!D29","v":39.878},{"$f":"Input!D30","v":59.528000000000006},{"$f":"Input!D31","v":79.177999999999997},{"$f":"Input!D32","v":576.48878080473003},{"$f":"Input!D33","v":""},{"$f":"'thermoplastic (40 mil)'!CA9","v":2500000},{"$f":"'thermoplastic (40 mil)'!CB9","v":4970052.0104158605},{"$f":"'thermoplastic (40 mil)'!CC9","v":7289493.6888617631},{"$f":"'thermoplastic (40 mil)'!CD9","v":9435025.6561157759},{"$f":"'thermoplastic (40 mil)'!CE9","v":11408928.346336108},{"$f":"'thermoplastic (40 mil)'!CF9","v":0},"40 mil",1,1,1,1,1,1,null,null,null,null,null,null,null,null,null,"40 mil",1,1,1,1,1,1]
[null,null,null,"White Edge","40 mil",{"$f":"Input!$B19","v":1039},{"$f":"Input!$D19","v":5250},{"$f":"F117*(1-Input!$B$23/100)","v":883.15},null,{"$f":"F117*(1+Input!$B$24/100)","v":1194.8499999999999},null,{"$f":"L116","v":70.526903758950084},{"$f":"M116","v":127.86745896720328},{"$f":"N116","v":2692.8377206276123},{"$f":"O116","v":12436.000747617014},{"$f":"P116","v":57431.650414747659},{"$f":"Q116","v":""},{"$f":"R116","v":20.227999999999998},{"$f":"S116","v":39.878},{"$f":"T116","v":59.528000000000006},{"$f":"U116","v":79.177999999999997},{"$f":"V116","v":576.48878080473003},{"$f":"W116","v":""},{"$f":"'thermoplastic (40 mil)'!CA10","v":2500000},{"$f":"'thermoplastic (40 mil)'!CB10","v":5000000},{"$f":"'thermoplastic (40 mil)'!CC10","v":7500000},{"$f":"'thermoplastic (40 mil)'!CD10","v":10000000},{"$f":"'thermoplastic (40 mil)'!CE10","v":12500000},{"$f":"'thermoplastic (40 mil)'!CF10","v":0},null,1,1,1,1,1,1,null,null,null,null,null,null,null,null,null,null,1,1,1,1,1,1]
[null,null,null,"White Lane","40 mil",{"$f":"Input!$C19","v":391},{"$f":"Input!$E19","v":5250},{"$f":"F118*(1-Input!$B$23/100)","v":332.34999999999997},null,{"$f":"F118*(1+Input!$B$24/100)","v":449.65},null,70.526903758950084,127.86745896720328,2692.8377206276123,12436.000747617014,57431.650414747659,"",20.227999999999998,39.878,59.528000000000006,79.177999999999997,576.48878080473003,"",{"$f":"'thermoplastic (40 mil)'!CA11","v":2500000},{"$f":"'thermoplastic (40 mil)'!CB11","v":5000000},{"$f":"'thermoplastic (40 mil)'!CC11","v":7500000},{"$f":"'thermoplastic (40 mil)'!CD11","v":10000000},{"$f":"'thermoplastic (40 mil)'!CE11","v":12500000},{"$f":"'thermoplastic (40 mil)'!CF11","v":0},null,1,1,1,1,1,1,null,null,null,null,null,null,null,null,null,null,1,1,1,1,1,1]
[null,null,"AC","Yellow Edge","40 mil",{"$f":"Input!$B19","v":1039},{"$f":"Input!$D19","v":5250},{"$f":"F119*(1-Input!$B$23/100)","v":883.15},null,{"$f":"F119*(1+Input!$B$24/100)","v":1194.8499999999999},null,70.526903758950084,127.86745896720328,2692.8377206276123,12436.000747617014,57431.650414747659,"",20.227999999999998,39.878,59.528000000000006,79.177999999999997,576.48878080473003,"",{"$f":"'thermoplastic (40 mil)'!CA12","v":2500000},{"$f":"'thermoplastic (40 mil)'!CB12","v":4431623.7017766898},{"$f":"'thermoplastic (40 mil)'!CC12","v":4181815.1807646956},{"$f":"'thermoplastic (40 mil)'!CD12","v":2861205.4021656606},{"$f":"'thermoplastic (40 mil)'!CE12","v":774687.12886712863},{"$f":"'thermoplastic (40 mil)'!CF12","v":0},null,1,1,1,1,1,1,null,null,null,null,null,null,null,null,null,null,1,1,1,1,1,1]
[null,null,null,"White Edge","40 mil",{"$f":"Input!$B19","v":1039},{"$f":"Input!$D19","v":5250},{"$f":"F120*(1-Input!$B$23/100)","v":883.15},null,{"$f":"F120*(1+Input!$B$24/100)","v":1194.8499999999999},null,70.526903758950084,127.86745896720328,2692.8377206276123,12436.000747617014,57431.650414747659,"",20.227999999999998,39.878,59.528000000000006,79.177999999999997,576.48878080473003,"",{"$f":"'thermoplastic (40 mil)'!CA13","v":2500000},{"$f":"'thermoplastic (40 mil)'!CB13","v":5000000},{"$f":"'thermoplastic (40 mil)'!CC13","v":7500000},{"$f":"'thermoplastic (40 mil)'!CD13","v":9670632.4016774707},{"$f":"'thermoplastic (40 mil)'!CE13","v":7922944.4835875742},{"$f":"'thermoplastic (40 mil)'!CF13","v":0},null,1,1,1,1,1,1,null,null,null,null,null,null,null,null,null,null,1,1,1,1,1,1]
[null,null,null,"White Lane","40 mil",{"$f":"Input!$C19","v":391},{"$f":"Input!$E19","v":5250},{"$f":"F121*(1-Input!$B$23/100)","v":332.34999999999997},null,{"$f":"F121*(1+Input!$B$24/100)","v":449.65},null,70.526903758950084,127.86745896720328,2692.8377206276123,12436.000747617014,57431.650414747659,"",20.227999999999998,39.878,59.528000000000006,79.177999999999997,576.48878080473003,"",{"$f":"'thermoplastic (40 mil)'!CA14","v":2500000},{"$f":"'thermoplastic (40 mil)'!CB14","v":5000000},{"$f":"'thermoplastic (40 mil)'!CC14","v":7500000},{"$f":"'thermoplastic (40 mil)'!CD14","v":9670632.4016774707},{"$f":"'thermoplastic (40 mil)'!CE14","v":7922944.4835875742},{"$f":"'thermoplastic (40 mil)'!CF14","v":0},null,1,1,1,1,1,1,null,null,null,null,null,null,null,null,null,null,1,1,1,1,1,1]
[null,"Thermo (90 mil)","PCC","Yellow Edge","90 mil",{"$f":"Input!$B20","v":2458},{"$f":"Input!$D20","v":5250},{"$f":"F122*(1-Input!$B$23/100)","v":2089.2999999999997},null,{"$f":"F122*(1+Input!$B$24/100)","v":2826.7},null,70.526903758950084,127.86745896720328,2692.8377206276123,12436.000747617014,57431.650414747659,"",20.227999999999998,39.878,59.528000000000006,79.177999999999997,576.48878080473003,"",{"$f":"'thermoplastic (90 mil)'!CA9","v":2500000},{"$f":"'thermoplastic (90 mil)'!CB9","v":5000000},{"$f":"'thermoplastic (90 mil)'!CC9","v":7500000},{"$f":"'thermoplastic (90 mil)'!CD9","v":10000000},{"$f":"'thermoplastic (90 mil)'!CE9","v":12500000},{"$f":"'thermoplastic (90 mil)'!CF9","v":0},null,{"$f":"X116/(X122+(X122-X116)*L122/($H116+$I116))","v":1},{"$f":"Y116/(Y122+(Y122-Y116)*M122/($H116+$I116))","v":0.99314913529707138},{"$f":"Z116/(Z122+(Z122-Z116)*N122/($H116+$I116))","v":0.89531053143747208},{"$f":"AA116/(AA122+(AA122-AA116)*O122/($H116+$I116))","v":0.52546313622999619},{"$f":"AB116/(AB122+(AB122-AB116)*P122/($H116+$I116))","v":0.13671100178224641},{"$f":"AC116/(AC122+(AC122-AC116)*Q122/($H116+$I116))","v":{"$error":"#VALUE!"}},null,null,null,null,null,null,null,null,null,null,{"$f":"X116/(X122+(X122-X116)*R122/($J116+$K116))","v":1},{"$f":"Y116/(Y122+(Y122-Y116)*S122/($J116+$K116))","v":0.99381173689559987},0.97057530076940812,0.93998339721531432,0.87583005025703176,{"$error":"#VALUE!"}]
[null,null,null,"White Edge","90 mil",{"$f":"Input!$B20","v":2458},{"$f":"Input!$D20","v":5250},{"$f":"F123*(1-Input!$B$23/100)","v":2089.2999999999997},null,{"$f":"F123*(1+Input!$B$24/100)","v":2826.7},null,70.526903758950084,127.86745896720328,2692.8377206276123,12436.000747617014,57431.650414747659,"",20.227999999999998,39.878,59.528000000000006,79.177999999999997,576.48878080473003,"",{"$f":"'thermoplastic (90 mil)'!CA10","v":2500000},{"$f":"'thermoplastic (90 mil)'!CB10","v":5000000},{"$f":"'thermoplastic (90 mil)'!CC10","v":7500000},{"$f":"'thermoplastic (90 mil)'!CD10","v":10000000},{"$f":"'thermoplastic (90 mil)'!CE10","v":12500000},{"$f":"'thermoplastic (90 mil)'!CF10","v":0},null,{"$f":"X117/(X123+(X123-X117)*L123/($H117+$I117))","v":1},1,1,1,1,{"$error":"#VALUE!"},null,null,null,null,null,null,null,null,null,null,1,{"$f":"Y117/(Y123+(Y123-Y117)*S123/($J117+$K117))","v":1},1,1,1,{"$error":"#VALUE!"}]
[null,null,null,"White Lane","90 mil",{"$f":"Input!$C20","v":817},{"$f":"Input!$E20","v":5250},{"$f":"F124*(1-Input!$B$23/100)","v":694.44999999999993},null,{"$f":"F124*(1+Input!$B$24/100)","v":939.55},null,70.526903758950084,127.86745896720328,2692.8377206276123,12436.000747617014,57431.650414747659,"",20.227999999999998,39.878,59.528000000000006,79.177999999999997,576.48878080473003,"",{"$f":"'thermoplastic (90 mil)'!CA11","v":2500000},{"$f":"'thermoplastic (90 mil)'!CB11","v":5000000},{"$f":"'thermoplastic (90 mil)'!CC11","v":7500000},{"$f":"'thermoplastic (90 mil)'!CD11","v":10000000},{"$f":"'thermoplastic (90 mil)'!CE11","v":12500000},{"$f":"'thermoplastic (90 mil)'!CF11","v":0},null,1,1,1,1,1,{"$error":"#VALUE!"},null,null,null,null,null,null,null,null,null,null,1,{"$f":"Y118/(Y124+(Y124-Y118)*S124/($J118+$K118))","v":1},1,1,1,{"$error":"#VALUE!"}]
[null,null,"AC","Yellow Edge","90 mil",{"$f":"Input!$B20","v":2458},{"$f":"Input!$D20","v":5250},{"$f":"F125*(1-Input!$B$23/100)","v":2089.2999999999997},null,{"$f":"F125*(1+Input!$B$24/100)","v":2826.7},null,70.526903758950084,127.86745896720328,2692.8377206276123,12436.000747617014,57431.650414747659,"",20.227999999999998,39.878,59.528000000000006,79.177999999999997,576.48878080473003,"",{"$f":"'thermoplastic (90 mil)'!CA12","v":2500000},{"$f":"'thermoplastic (90 mil)'!CB12","v":5000000},{"$f":"'thermoplastic (90 mil)'!CC12","v":7500000},{"$f":"'thermoplastic (90 mil)'!CD12","v":10000000},{"$f":"'thermoplastic (90 mil)'!CE12","v":12500000},{"$f":"'thermoplastic (90 mil)'!CF12","v":0},null,1,0.87197332558855845,0.237366153869566,2.588756348769413E-2,9.9959308988704899E-4,{"$error":"#VALUE!"},null,null,null,null,null,null,null,null,null,null,1,{"$f":"Y119/(Y125+(Y125-Y119)*S125/($J119+$K119))","v":0.88297482174378161},0.5455504394700661,0.2731967029833462,4.2665549651508199E-2,{"$error":"#VALUE!"}]
[null,null,null,"White Edge","90 mil",{"$f":"Input!$B20","v":2458},{"$f":"Input!$D20","v":5250},{"$f":"F126*(1-Input!$B$23/100)","v":2089.2999999999997},null,{"$f":"F126*(1+Input!$B$24/100)","v":2826.7},null,70.526903758950084,127.86745896720328,2692.8377206276123,12436.000747617014,57431.650414747659,"",20.227999999999998,39.878,59.528000000000006,79.177999999999997,576.48878080473003,"",{"$f":"'thermoplastic (90 mil)'!CA13","v":2500000},{"$f":"'thermoplastic (90 mil)'!CB13","v":5000000},{"$f":"'thermoplastic (90 mil)'!CC13","v":7500000},{"$f":"'thermoplastic (90 mil)'!CD13","v":10000000},{"$f":"'thermoplastic (90 mil)'!CE13","v":12500000},{"$f":"'thermoplastic (90 mil)'!CF13","v":0},null,1,1,1,0.66065431320384782,2.5545687452063745E-2,{"$error":"#VALUE!"},null,null,null,null,null,null,null,null,null,null,1,{"$f":"Y120/(Y126+(Y126-Y120)*S126/($J120+$K120))","v":1},1,0.96495713509423586,0.53867062820677536,{"$error":"#VALUE!"}]
[null,null,null,"White Lane","90 mil",{"$f":"Input!$C20","v":817},{"$f":"Input!$E20","v":5250},{"$f":"F127*(1-Input!$B$23/100)","v":694.44999999999993},null,{"$f":"F127*(1+Input!$B$24/100)","v":939.55},null,70.526903758950084,127.86745896720328,2692.8377206276123,12436.000747617014,57431.650414747659,"",20.227999999999998,39.878,59.528000000000006,79.177999999999997,576.48878080473003,"",{"$f":"'thermoplastic (90 mil)'!CA14","v":2500000},{"$f":"'thermoplastic (90 mil)'!CB14","v":5000000},{"$f":"'thermoplastic (90 mil)'!CC14","v":7500000},{"$f":"'thermoplastic (90 mil)'!CD14","v":10000000},{"$f":"'thermoplastic (90 mil)'!CE14","v":12500000},{"$f":"'thermoplastic (90 mil)'!CF14","v":0},null,1,1,1,0.43318658644248786,9.8613161356549302E-3,{"$error":"#VALUE!"},null,null,null,null,null,null,null,null,null,null,1,{"$f":"Y121/(Y127+(Y127-Y121)*S127/($J121+$K121))","v":1},1,0.9614868372484745,0.43134105951988277,{"$error":"#VALUE!"}]
[null,"Tape","PCC","Yellow Edge","tape",{"$f":"Input!$B21","v":8108},{"$f":"Input!$D21","v":5250},{"$f":"F128*(1-Input!$B$23/100)","v":6891.8},null,{"$f":"F128*(1+Input!$B$24/100)","v":9324.1999999999989},null,70.526903758950084,127.86745896720328,2692.8377206276123,12436.000747617014,57431.650414747659,"",20.227999999999998,39.878,59.528000000000006,79.177999999999997,576.48878080473003,"",{"$f":"tape!CA9","v":2500000},{"$f":"tape!CB9","v":5000000},{"$f":"tape!CC9","v":7500000},{"$f":"tape!CD9","v":10000000},{"$f":"tape!CE9","v":12500000},{"$f":"tape!CF9","v":0},null,{"$f":"X116/(X128+(X128-X116)*L128/($H116+$I116))","v":1},{"$f":"Y116/(Y128+(Y128-Y116)*M128/($H116+$I116))","v":0.99314913529707138},{"$f":"Z116/(Z128+(Z128-Z116)*N128/($H116+$I116))","v":0.89531053143747208},{"$f":"AA116/(AA128+(AA128-AA116)*O128/($H116+$I116))","v":0.52546313622999619},{"$f":"AB116/(AB128+(AB128-AB116)*P128/($H116+$I116))","v":0.13671100178224641},{"$f":"AC116/(AC128+(AC128-AC116)*Q128/($H116+$I116))","v":{"$error":"#VALUE!"}},null,null,null,null,null,null,null,null,null,null,{"$f":"X116/(X128+(X128-X116)*R128/($J116+$K116))","v":1},{"$f":"Y116/(Y128+(Y128-Y116)*S128/($J116+$K116))","v":0.99381173689559987},0.97057530076940812,0.93998339721531432,0.87583005025703176,{"$error":"#VALUE!"}]
[null,null,null,"White Edge","tape",{"$f":"Input!$B21","v":8108},{"$f":"Input!$D21","v":5250},{"$f":"F129*(1-Input!$B$23/100)","v":6891.8},null,{"$f":"F129*(1+Input!$B$24/100)","v":9324.1999999999989},null,70.526903758950084,127.86745896720328,2692.8377206276123,12436.000747617014,57431.650414747659,"",20.227999999999998,39.878,59.528000000000006,79.177999999999997,576.48878080473003,"",{"$f":"tape!CA10","v":2500000},{"$f":"tape!CB10","v":5000000},{"$f":"tape!CC10","v":7500000},{"$f":"tape!CD10","v":10000000},{"$f":"tape!CE10","v":12500000},{"$f":"tape!CF10","v":0},null,{"$f":"X117/(X129+(X129-X117)*L129/($H117+$I117))","v":1},1,1,1,1,{"$error":"#VALUE!"},null,null,null,null,null,null,null,null,null,null,1,{"$f":"Y117/(Y129+(Y129-Y117)*S129/($J117+$K117))","v":1},1,1,1,{"$error":"#VALUE!"}]
[null,null,null,"White Lane","tape",{"$f":"Input!$C21","v":3861},{"$f":"Input!$E21","v":5250},{"$f":"F130*(1-Input!$B$23/100)","v":3281.85},null,{"$f":"F130*(1+Input!$B$24/100)","v":4440.1499999999996},null,70.526903758950084,127.86745896720328,2692.8377206276123,12436.000747617014,57431.650414747659,"",20.227999999999998,39.878,59.528000000000006,79.177999999999997,576.48878080473003,"",{"$f":"tape!CA11","v":2500000},{"$f":"tape!CB11","v":5000000},{"$f":"tape!CC11","v":7500000},{"$f":"tape!CD11","v":10000000},{"$f":"tape!CE11","v":12500000},{"$f":"tape!CF11","v":0},null,1,1,1,1,1,{"$error":"#VALUE!"},null,null,null,null,null,null,null,null,null,null,1,{"$f":"Y118/(Y130+(Y130-Y118)*S130/($J118+$K118))","v":1},1,1,1,{"$error":"#VALUE!"}]
[null,null,"AC","Yellow Edge","tape",{"$f":"Input!$B21","v":8108},{"$f":"Input!$D21","v":5250},{"$f":"F131*(1-Input!$B$23/100)","v":6891.8},null,{"$f":"F131*(1+Input!$B$24/100)","v":9324.1999999999989},null,70.526903758950084,127.86745896720328,2692.8377206276123,12436.000747617014,57431.650414747659,"",20.227999999999998,39.878,59.528000000000006,79.177999999999997,576.48878080473003,"",{"$f":"tape!CA12","v":2500000},{"$f":"tape!CB12","v":5000000},{"$f":"tape!CC12","v":7500000},{"$f":"tape!CD12","v":10000000},{"$f":"tape!CE12","v":12500000},{"$f":"tape!CF12","v":0},null,1,0.87197332558855845,0.237366153869566,2.588756348769413E-2,9.9959308988704899E-4,{"$error":"#VALUE!"},null,null,null,null,null,null,null,null,null,null,1,{"$f":"Y119/(Y131+(Y131-Y119)*S131/($J119+$K119))","v":0.88297482174378161},0.5455504394700661,0.2731967029833462,4.2665549651508199E-2,{"$error":"#VALUE!"}]
[null,null,null,"White Edge","tape",{"$f":"Input!$B21","v":8108},{"$f":"Input!$D21","v":5250},{"$f":"F132*(1-Input!$B$23/100)","v":6891.8},null,{"$f":"F132*(1+Input!$B$24/100)","v":9324.1999999999989},null,70.526903758950084,127.86745896720328,2692.8377206276123,12436.000747617014,57431.650414747659,"",20.227999999999998,39.878,59.528000000000006,79.177999999999997,576.48878080473003,"",{"$f":"tape!CA13","v":2500000},{"$f":"tape!CB13","v":5000000},{"$f":"tape!CC13","v":7500000},{"$f":"tape!CD13","v":10000000},{"$f":"tape!CE13","v":12500000},{"$f":"tape!CF13","v":0},null,1,1,1,0.66065431320384782,2.5545687452063745E-2,{"$error":"#VALUE!"},null,null,null,null,null,null,null,null,null,null,1,{"$f":"Y120/(Y132+(Y132-Y120)*S132/($J120+$K120))","v":1},1,0.96495713509423586,0.53867062820677536,{"$error":"#VALUE!"}]
[null,null,null,"White Lane","tape",{"$f":"Input!$C21","v":3861},{"$f":"Input!$E21","v":5250},{"$f":"F133*(1-Input!$B$23/100)","v":3281.85},null,{"$f":"F133*(1+Input!$B$24/100)","v":4440.1499999999996},null,70.526903758950084,127.86745896720328,2692.8377206276123,12436.000747617014,57431.650414747659,"",20.227999999999998,39.878,59.528000000000006,79.177999999999997,576.48878080473003,"",{"$f":"tape!CA14","v":2500000},{"$f":"tape!CB14","v":5000000},{"$f":"tape!CC14","v":7500000},{"$f":"tape!CD14","v":10000000},{"$f":"tape!CE14","v":12500000},{"$f":"tape!CF14","v":0},null,1,1,1,0.43318658644248786,9.8613161356549302E-3,{"$error":"#VALUE!"},null,null,null,null,null,null,null,null,null,null,1,{"$f":"Y121/(Y133+(Y133-Y121)*S133/($J121+$K121))","v":1},1,0.9614868372484745,0.43134105951988277,{"$error":"#VALUE!"}]
[null,"Inverted","PCC","Yellow Edge","inverted",{"$f":"Input!$B22","v":5270},{"$f":"Input!$D22","v":5250},{"$f":"F134*(1-Input!$B$23/100)","v":4479.5},null,{"$f":"F134*(1+Input!$B$24/100)","v":6060.4999999999991},null,70.526903758950084,127.86745896720328,2692.8377206276123,12436.000747617014,57431.650414747659,"",20.227999999999998,39.878,59.528000000000006,79.177999999999997,576.48878080473003,"",{"$f":"inverted!CA9","v":2500000},{"$f":"inverted!CB9","v":5000000},{"$f":"inverted!CC9","v":7500000},{"$f":"inverted!CD9","v":10000000},{"$f":"inverted!CE9","v":12500000},{"$f":"inverted!CF9","v":0},null,{"$f":"X116/(X134+(X134-X116)*L134/($H116+$I116))","v":1},{"$f":"Y116/(Y134+(Y134-Y116)*M134/($H116+$I116))","v":0.99314913529707138},{"$f":"Z116/(Z134+(Z134-Z116)*N134/($H116+$I116))","v":0.89531053143747208},{"$f":"AA116/(AA134+(AA134-AA116)*O134/($H116+$I116))","v":0.52546313622999619},{"$f":"AB116/(AB134+(AB134-AB116)*P134/($H116+$I116))","v":0.13671100178224641},{"$f":"AC116/(AC134+(AC134-AC116)*Q134/($H116+$I116))","v":{"$error":"#VALUE!"}},null,null,null,null,null,null,null,null,null,null,{"$f":"X116/(X134+(X134-X116)*R134/($J116+$K116))","v":1},{"$f":"Y116/(Y134+(Y134-Y116)*S134/($J116+$K116))","v":0.99381173689559987},0.97057530076940812,0.93998339721531432,0.87583005025703176,{"$error":"#VALUE!"}]
[null,null,null,"White Edge","inverted",{"$f":"Input!$B22","v":5270},{"$f":"Input!$D22","v":5250},{"$f":"F135*(1-Input!$B$23/100)","v":4479.5},null,{"$f":"F135*(1+Input!$B$24/100)","v":6060.4999999999991},null,70.526903758950084,127.86745896720328,2692.8377206276123,12436.000747617014,57431.650414747659,"",20.227999999999998,39.878,59.528000000000006,79.177999999999997,576.48878080473003,"",{"$f":"inverted!CA10","v":2500000},{"$f":"inverted!CB10","v":5000000},{"$f":"inverted!CC10","v":7500000},{"$f":"inverted!CD10","v":8104940.3426599838},{"$f":"inverted!CE10","v":5266744.0752656925},{"$f":"inverted!CF10","v":0},null,{"$f":"X117/(X135+(X135-X117)*L135/($H117+$I117))","v":1},1,1,-0.53820794178701514,-2.6875061583366156E-2,{"$error":"#VALUE!"},null,null,null,null,null,null,null,null,null,null,{"$f":"X117/(X135+(X135-X117)*R135/($J117+$K117))","v":1},{"$f":"Y117/(Y135+(Y135-Y117)*S135/($J117+$K117))","v":1},1,1.253232995150011,7.0348913734612166,{"$error":"#VALUE!"}]
[null,null,null,"White Lane","inverted",{"$f":"Input!$C22","v":2505},{"$f":"Input!$E22","v":5250},{"$f":"F136*(1-Input!$B$23/100)","v":2129.25},null,{"$f":"F136*(1+Input!$B$24/100)","v":2880.75},null,70.526903758950084,127.86745896720328,2692.8377206276123,12436.000747617014,57431.650414747659,"",20.227999999999998,39.878,59.528000000000006,79.177999999999997,576.48878080473003,"",{"$f":"inverted!CA11","v":2500000},{"$f":"inverted!CB11","v":5000000},{"$f":"inverted!CC11","v":7500000},{"$f":"inverted!CD11","v":8104940.3426599838},{"$f":"inverted!CE11","v":5266744.0752656925},{"$f":"inverted!CF11","v":0},null,1,1,1,-0.15922265126310106,-1.0042789851562959E-2,{"$error":"#VALUE!"},null,null,null,null,null,null,null,null,null,null,{"$f":"X118/(X136+(X136-X118)*R136/($J118+$K118))","v":1},{"$f":"Y118/(Y136+(Y136-Y118)*S136/($J118+$K118))","v":1},1,1.286795441479291,-3.1196241451470481,{"$error":"#VALUE!"}]
[null,null,"AC","Yellow Edge","inverted",null,null,null,null,null,null,null,null,null,null,null,null,null,null,null,null,null,null,{"$f":"inverted!CA12","v":0},{"$f":"inverted!CB12","v":0},{"$f":"inverted!CC12","v":0},{"$f":"inverted!CD12","v":0},{"$f":"inverted!CE12","v":0},{"$f":"inverted!CF12","v":0}]
[null,null,null,"White Edge","inverted",null,null,null,null,null,null,null,null,null,null,null,null,null,null,null,null,null,null,{"$f":"inverted!CA13","v":0},{"$f":"inverted!CB13","v":0},{"$f":"inverted!CC13","v":0},{"$f":"inverted!CD13","v":0},{"$f":"inverted!CE13","v":0},{"$f":"inverted!CF13","v":0}]
[null,null,null,"White Lane","inverted",null,null,null,null,null,null,null,null,null,null,null,null,null,null,null,null,null,null,{"$f":"inverted!CA14","v":0},{"$f":"inverted!CB14","v":0},{"$f":"inverted!CC14","v":0},{"$f":"inverted!CD14","v":0},{"$f":"inverted!CE14","v":0},{"$f":"inverted!CF14","v":0},null,null,null,null,null,null,null,"Finding Min Benefit/Cost as reference"]
[null,null,null,null,null,null,null,null,null,null,null,null,null,null,null,null,null,null,null,null,null,null,null,null,null,null,null,null,null,"90 mil",{"$f":"X122/(X116+(X116-X122)*L116/($H122+$I122))","v":1},{"$f":"Y122/(Y116+(Y116-Y122)*M116/($H122+$I122))","v":1.0063968272077688},{"$f":"Z122/(Z116+(Z116-Z122)*N116/($H122+$I122))","v":1.0686533922381158},{"$f":"AA122/(AA116+(AA116-AA122)*O116/($H122+$I122))","v":1.6468586270887471},{"$f":"AB122/(AB116+(AB116-AB122)*P116/($H122+$I122))","v":-0.67265936658057035},{"$f":"AC122/(AC116+(AC116-AC122)*Q116/($H122+$I122))","v":{"$error":"#VALUE!"}},null,null,null,5000,10000,15000,20000,25000,{"$f":"IF(Input!$B$33=\"No\",\"\",Input!$B$33)","v":""},"90 mil",{"$f":"X122/(X116+(X116-X122)*R116/($J122+$K122))","v":1},{"$f":"Y122/(Y116+(Y116-Y122)*S116/($J122+$K122))","v":1.0061112169921516},1.0295041338017903,1.0616612539472121,1.1174272347156855,{"$error":"#VALUE!"}]
[null,null,null,null,null,null,null,null,null,null,null,null,null,null,null,null,null,null,null,null,"Finding Min Benefit/Cost","PCC","Yellow Edge",{"$f":"MIN(Results!E51,Results!E57,Results!E63,Results!E69)","v":359.07535434026425},{"$f":"MIN(Results!F51,Results!F57,Results!F63,Results!F69)","v":712.28445353387792},{"$f":"MIN(Results!G51,Results!G57,Results!G63,Results!G69)","v":782.50218929598645},{"$f":"MIN(Results!H51,Results!H57,Results!H63,Results!H69)","v":517.38943972882851},{"$f":"MIN(Results!I51,Results!I57,Results!I63,Results!I69)","v":194.33037126276548},{"$f":"MIN(Results!J51,Results!J57,Results!J63,Results!J69)","v":0},null,{"$f":"X123/(X117+(X117-X123)*L117/($H123+$I123))","v":1},1,1,1,1,{"$error":"#VALUE!"},"Finding Min Benefit/Cost","PCC","Yellow Edge",{"$f":"MIN(Results!L51,Results!L57,Results!L63,Results!L69)","v":267.53911528881173},{"$f":"MIN(Results!M51,Results!M57,Results!M63,Results!M69)","v":533.95539849198178},{"$f":"MIN(Results!N51,Results!N57,Results!N63,Results!N69)","v":799.25590341067016},{"$f":"MIN(Results!O51,Results!O57,Results!O63,Results!O69)","v":1063.4476248854403},{"$f":"MIN(Results!P51,Results!P57,Results!P63,Results!P69)","v":1262.5384230069697},{"$f":"MIN(Results!Q51,Results!Q57,Results!Q63,Results!Q69)","v":0},null,1,{"$f":"Y123/(Y117+(Y117-Y123)*S117/($J123+$K123))","v":1},1,1,1,{"$error":"#VALUE!"}]
[null,null,null,null,null,null,null,null,null,null,null,null,null,null,null,null,null,null,null,null,null,null,"White Edge",{"$f":"MIN(Results!E52,Results!E58,Results!E64,Results!E70)","v":359.07535434026425},{"$f":"MIN(Results!F52,Results!F58,Results!F64,Results!F70)","v":712.28445353387792},{"$f":"MIN(Results!G52,Results!G58,Results!G64,Results!G70)","v":782.50218929598645},{"$f":"MIN(Results!H52,Results!H58,Results!H64,Results!H70)","v":479.14279710588966},{"$f":"MIN(Results!I52,Results!I58,Results!I64,Results!I70)","v":85.069394446450445},{"$f":"MIN(Results!J52,Results!J58,Results!J64,Results!J70)","v":0},null,1,1,1,1,1,{"$error":"#VALUE!"},null,null,"White Edge",{"$f":"MIN(Results!L52,Results!L58,Results!L64,Results!L70)","v":267.53911528881173},{"$f":"MIN(Results!M52,Results!M58,Results!M64,Results!M70)","v":533.95539849198178},{"$f":"MIN(Results!N52,Results!N58,Results!N64,Results!N70)","v":799.25590341067016},{"$f":"MIN(Results!O52,Results!O58,Results!O64,Results!O70)","v":1063.4476248854403},{"$f":"MIN(Results!P52,Results!P58,Results!P64,Results!P70)","v":793.54421850131632},{"$f":"MIN(Results!Q52,Results!Q58,Results!Q64,Results!Q70)","v":0},null,1,{"$f":"Y124/(Y118+(Y118-Y124)*S118/($J124+$K124))","v":1},1,1,1,{"$error":"#VALUE!"}]
[null,null,null,null,null,null,null,null,null,null,null,null,null,null,null,null,null,null,null,null,null,null,"White Lane",{"$f":"MIN(Results!E53,Results!E59,Results!E65,Results!E71)","v":745.73953698249215},{"$f":"MIN(Results!F53,Results!F59,Results!F65,Results!F71)","v":1466.3971605185407},{"$f":"MIN(Results!G53,Results!G59,Results!G65,Results!G71)","v":1255.2957327135687},{"$f":"MIN(Results!H53,Results!H59,Results!H65,Results!H71)","v":556.45731632776824},{"$f":"MIN(Results!I53,Results!I59,Results!I65,Results!I71)","v":88.426199714764778},{"$f":"MIN(Results!J53,Results!J59,Results!J65,Results!J71)","v":0},null,1,1.1371807402914276,-79.033660411905458,-0.25233049577238503,-3.8875875376860658E-2,{"$error":"#VALUE!"},null,null,"White Lane",{"$f":"MIN(Results!L53,Results!L59,Results!L65,Results!L71)","v":560.49061312740764},{"$f":"MIN(Results!M53,Results!M59,Results!M65,Results!M71)","v":1116.0644531685964},{"$f":"MIN(Results!N53,Results!N59,Results!N65,Results!N71)","v":1666.7859344601991},{"$f":"MIN(Results!O53,Results!O59,Results!O65,Results!O71)","v":2212.7183510468817},{"$f":"MIN(Results!P53,Results!P59,Results!P65,Results!P71)","v":1523.3960999476494},{"$f":"MIN(Results!Q53,Results!Q59,Results!Q65,Results!Q71)","v":0},null,1,{"$f":"Y125/(Y119+(Y119-Y125)*S119/($J125+$K125))","v":1.1302997664540155},1.8239579455698627,3.7576434526793894,-7.7321761046005157,{"$error":"#VALUE!"}]
[null,null,null,null,null,null,null,null,null,null,null,null,null,null,null,null,null,null,null,null,null,"AC","Yellow Edge",{"$f":"MIN(Results!E54,Results!E60,Results!E66)","v":359.07535434026425},{"$f":"MIN(Results!F54,Results!F60,Results!F66)","v":712.28445353387792},{"$f":"MIN(Results!G54,Results!G60,Results!G66)","v":782.50218929598645},{"$f":"MIN(Results!H54,Results!H60,Results!H66)","v":214.81890672928762},{"$f":"MIN(Results!I54,Results!I60,Results!I66)","v":13.28457138423494},{"$f":"MIN(Results!J54,Results!J60,Results!J66)","v":0},null,1,1,1,1.2969900029115007,-0.10602808966236257,{"$error":"#VALUE!"},null,"AC","Yellow Edge",{"$f":"MIN(Results!L54,Results!L60,Results!L66)","v":267.53911528881173},{"$f":"MIN(Results!M54,Results!M60,Results!M66)","v":533.95539849198178},{"$f":"MIN(Results!N54,Results!N60,Results!N66)","v":799.25590341067016},{"$f":"MIN(Results!O54,Results!O60,Results!O66)","v":1063.4476248854403},{"$f":"MIN(Results!P54,Results!P60,Results!P66)","v":437.34554748199184},{"$f":"MIN(Results!Q54,Results!Q60,Results!Q66)","v":0},null,1,{"$f":"Y126/(Y120+(Y120-Y126)*S120/($J126+$K126))","v":1},1,1.0350459770998295,1.7884017357974011,{"$error":"#VALUE!"}]
[null,null,null,null,null,null,null,null,null,null,null,null,null,null,null,null,null,null,null,null,null,null,"White Edge",{"$f":"MIN(Results!E55,Results!E61,Results!E67)","v":359.07535434026425},{"$f":"MIN(Results!F55,Results!F61,Results!F67)","v":712.28445353387792},{"$f":"MIN(Results!G55,Results!G61,Results!G67)","v":782.50218929598645},{"$f":"MIN(Results!H55,Results!H61,Results!H67)","v":517.38943972882851},{"$f":"MIN(Results!I55,Results!I61,Results!I67)","v":135.86507074083858},{"$f":"MIN(Results!J55,Results!J61,Results!J67)","v":0},null,1,1,1,2.6508204291069566,-3.3728748067473398E-2,{"$error":"#VALUE!"},null,null,"White Edge",{"$f":"MIN(Results!L55,Results!L61,Results!L67)","v":267.53911528881173},{"$f":"MIN(Results!M55,Results!M61,Results!M67)","v":533.95539849198178},{"$f":"MIN(Results!N55,Results!N61,Results!N67)","v":799.25590341067016},{"$f":"MIN(Results!O55,Results!O61,Results!O67)","v":1063.4476248854403},{"$f":"MIN(Results!P55,Results!P61,Results!P67)","v":1262.5384230069697},{"$f":"MIN(Results!Q55,Results!Q61,Results!Q67)","v":0},null,1,{"$f":"Y127/(Y121+(Y121-Y127)*S121/($J127+$K127))","v":1},1,1.0370350251400307,2.4440047897793122,{"$error":"#VALUE!"}]
[null,null,null,null,null,null,null,null,null,null,null,null,null,null,null,null,null,null,null,null,null,null,"White Lane",{"$f":"MIN(Results!E56,Results!E62,Results!E68)","v":745.73953698249215},{"$f":"MIN(Results!F56,Results!F62,Results!F68)","v":1466.3971605185407},{"$f":"MIN(Results!G56,Results!G62,Results!G68)","v":1255.2957327135687},{"$f":"MIN(Results!H56,Results!H62,Results!H68)","v":636.21929999024212},{"$f":"MIN(Results!I56,Results!I62,Results!I68)","v":137.16059183402362},{"$f":"MIN(Results!J56,Results!J62,Results!J68)","v":0},null,1,1,1,1,1,1,null,null,"White Lane",{"$f":"MIN(Results!L56,Results!L62,Results!L68)","v":560.49061312740764},{"$f":"MIN(Results!M56,Results!M62,Results!M68)","v":1116.0644531685964},{"$f":"MIN(Results!N56,Results!N62,Results!N68)","v":1666.7859344601991},{"$f":"MIN(Results!O56,Results!O62,Results!O68)","v":2212.7183510468817},{"$f":"MIN(Results!P56,Results!P62,Results!P68)","v":2491.7082026772614},{"$f":"MIN(Results!Q56,Results!Q62,Results!Q68)","v":0},null,1,1,1,1,1,1]
[null,null,null,null,null,null,null,null,null,null,null,null,null,null,null,null,null,null,null,null,"found min Benefit/Cost","PCC","Yellow Edge",{"$f":"IF(X141=Results!E51,\"40 mil\",IF(X141=Results!E57,\"90 mil\",IF(X141=Results!E63,\"Tape\",\"Inverted\")))","v":"Tape"},{"$f":"IF(Y141=Results!F51,\"40 mil\",IF(Y141=Results!F57,\"90 mil\",IF(Y141=Results!F63,\"Tape\",\"Inverted\")))","v":"Tape"},{"$f":"IF(Z141=Results!G51,\"40 mil\",IF(Z141=Results!G57,\"90 mil\",IF(Z141=Results!G63,\"Tape\",\"Inverted\")))","v":"Tape"},{"$f":"IF(AA141=Results!H51,\"40 mil\",IF(AA141=Results!H57,\"90 mil\",IF(AA141=Results!H63,\"Tape\",\"Inverted\")))","v":"Tape"},{"$f":"IF(AB141=Results!I51,\"40 mil\",IF(AB141=Results!I57,\"90 mil\",IF(AB141=Results!I63,\"Tape\",\"Inverted\")))","v":"Tape"},{"$f":"IF(AC141=Results!J51,\"40 mil\",IF(AC141=Results!J57,\"90 mil\",IF(AC141=Results!J63,\"Tape\",\"Inverted\")))","v":"40 mil"},null,1,1,1,1,1,1,"found min Benefit/Cost","PCC","Yellow Edge",{"$f":"IF(AN141=Results!L51,\"40 mil\",IF(AN141=Results!L57,\"90 mil\",IF(AN141=Results!L63,\"Tape\",\"Inverted\")))","v":"Tape"},{"$f":"IF(AO141=Results!M51,\"40 mil\",IF(AO141=Results!M57,\"90 mil\",IF(AO141=Results!M63,\"Tape\",\"Inverted\")))","v":"Tape"},{"$f":"IF(AP141=Results!N51,\"40 mil\",IF(AP141=Results!N57,\"90 mil\",IF(AP141=Results!N63,\"Tape\",\"Inverted\")))","v":"Tape"},{"$f":"IF(AQ141=Results!O51,\"40 mil\",IF(AQ141=Results!O57,\"90 mil\",IF(AQ141=Results!O63,\"Tape\",\"Inverted\")))","v":"Tape"},{"$f":"IF(AR141=Results!P51,\"40 mil\",IF(AR141=Results!P57,\"90 mil\",IF(AR141=Results!P63,\"Tape\",\"Inverted\")))","v":"Tape"},{"$f":"IF(AS141=Results!Q51,\"40 mil\",IF(AS141=Results!Q57,\"90 mil\",IF(AS141=Results!Q63,\"Tape\",\"Inverted\")))","v":"40 mil"},null,1,1,1,1,1,1]
[null,null,null,null,null,null,null,null,null,null,null,null,null,null,null,null,null,null,null,null,null,null,"White Edge",{"$f":"IF(X142=Results!E52,\"40 mil\",IF(X142=Results!E58,\"90 mil\",IF(X142=Results!E64,\"Tape\",\"Inverted\")))","v":"Tape"},{"$f":"IF(Y142=Results!F52,\"40 mil\",IF(Y142=Results!F58,\"90 mil\",IF(Y142=Results!F64,\"Tape\",\"Inverted\")))","v":"Tape"},{"$f":"IF(Z142=Results!G52,\"40 mil\",IF(Z142=Results!G58,\"90 mil\",IF(Z142=Results!G64,\"Tape\",\"Inverted\")))","v":"Tape"},{"$f":"IF(AA142=Results!H52,\"40 mil\",IF(AA142=Results!H58,\"90 mil\",IF(AA142=Results!H64,\"Tape\",\"Inverted\")))","v":"Inverted"},{"$f":"IF(AB142=Results!I52,\"40 mil\",IF(AB142=Results!I58,\"90 mil\",IF(AB142=Results!I64,\"Tape\",\"Inverted\")))","v":"Inverted"},{"$f":"IF(AC142=Results!J52,\"40 mil\",IF(AC142=Results!J58,\"90 mil\",IF(AC142=Results!J64,\"Tape\",\"Inverted\")))","v":"40 mil"},null,1,1,1,1,1,1,null,null,"White Edge",{"$f":"IF(AN142=Results!L52,\"40 mil\",IF(AN142=Results!L58,\"90 mil\",IF(AN142=Results!L64,\"Tape\",\"Inverted\")))","v":"Tape"},{"$f":"IF(AO142=Results!M52,\"40 mil\",IF(AO142=Results!M58,\"90 mil\",IF(AO142=Results!M64,\"Tape\",\"Inverted\")))","v":"Tape"},{"$f":"IF(AP142=Results!N52,\"40 mil\",IF(AP142=Results!N58,\"90 mil\",IF(AP142=Results!N64,\"Tape\",\"Inverted\")))","v":"Tape"},{"$f":"IF(AQ142=Results!O52,\"40 mil\",IF(AQ142=Results!O58,\"90 mil\",IF(AQ142=Results!O64,\"Tape\",\"Inverted\")))","v":"Tape"},{"$f":"IF(AR142=Results!P52,\"40 mil\",IF(AR142=Results!P58,\"90 mil\",IF(AR142=Results!P64,\"Tape\",\"Inverted\")))","v":"Inverted"},{"$f":"IF(AS142=Results!Q52,\"40 mil\",IF(AS142=Results!Q58,\"90 mil\",IF(AS142=Results!Q64,\"Tape\",\"Inverted\")))","v":"40 mil"},null,1,1,1,1,1,1]
[null,null,null,null,null,null,null,null,null,null,null,null,null,null,null,null,null,null,null,null,null,null,"White Lane",{"$f":"IF(X143=Results!E53,\"40 mil\",IF(X143=Results!E59,\"90 mil\",IF(X143=Results!E65,\"Tape\",\"Inverted\")))","v":"Tape"},{"$f":"IF(Y143=Results!F53,\"40 mil\",IF(Y143=Results!F59,\"90 mil\",IF(Y143=Results!F65,\"Tape\",\"Inverted\")))","v":"Tape"},{"$f":"IF(Z143=Results!G53,\"40 mil\",IF(Z143=Results!G59,\"90 mil\",IF(Z143=Results!G65,\"Tape\",\"Inverted\")))","v":"Tape"},{"$f":"IF(AA143=Results!H53,\"40 mil\",IF(AA143=Results!H59,\"90 mil\",IF(AA143=Results!H65,\"Tape\",\"Inverted\")))","v":"Inverted"},{"$f":"IF(AB143=Results!I53,\"40 mil\",IF(AB143=Results!I59,\"90 mil\",IF(AB143=Results!I65,\"Tape\",\"Inverted\")))","v":"Inverted"},{"$f":"IF(AC143=Results!J53,\"40 mil\",IF(AC143=Results!J59,\"90 mil\",IF(AC143=Results!J65,\"Tape\",\"Inverted\")))","v":"40 mil"},null,1,1,1,1,1,1,null,null,"White Lane",{"$f":"IF(AN143=Results!L53,\"40 mil\",IF(AN143=Results!L59,\"90 mil\",IF(AN143=Results!L65,\"Tape\",\"Inverted\")))","v":"Tape"},{"$f":"IF(AO143=Results!M53,\"40 mil\",IF(AO143=Results!M59,\"90 mil\",IF(AO143=Results!M65,\"Tape\",\"Inverted\")))","v":"Tape"},{"$f":"IF(AP143=Results!N53,\"40 mil\",IF(AP143=Results!N59,\"90 mil\",IF(AP143=Results!N65,\"Tape\",\"Inverted\")))","v":"Tape"},{"$f":"IF(AQ143=Results!O53,\"40 mil\",IF(AQ143=Results!O59,\"90 mil\",IF(AQ143=Results!O65,\"Tape\",\"Inverted\")))","v":"Tape"},{"$f":"IF(AR143=Results!P53,\"40 mil\",IF(AR143=Results!P59,\"90 mil\",IF(AR143=Results!P65,\"Tape\",\"Inverted\")))","v":"Inverted"},{"$f":"IF(AS143=Results!Q53,\"40 mil\",IF(AS143=Results!Q59,\"90 mil\",IF(AS143=Results!Q65,\"Tape\",\"Inverted\")))","v":"40 mil"},null,1,1,1,1,1,1]
[null,null,null,null,null,null,null,null,null,null,null,null,null,null,null,null,null,null,null,null,null,"AC","Yellow Edge",{"$f":"IF(X144=Results!E54,\"40 mil\",IF(X144=Results!E60,\"90 mil\",\"Tape\"))","v":"Tape"},{"$f":"IF(Y144=Results!F54,\"40 mil\",IF(Y144=Results!F60,\"90 mil\",\"Tape\"))","v":"Tape"},{"$f":"IF(Z144=Results!G54,\"40 mil\",IF(Z144=Results!G60,\"90 mil\",\"Tape\"))","v":"Tape"},{"$f":"IF(AA144=Results!H54,\"40 mil\",IF(AA144=Results!H60,\"90 mil\",\"Tape\"))","v":"40 mil"},{"$f":"IF(AB144=Results!I54,\"40 mil\",IF(AB144=Results!I60,\"90 mil\",\"Tape\"))","v":"40 mil"},{"$f":"IF(AC144=Results!J54,\"40 mil\",IF(AC144=Results!J60,\"90 mil\",\"Tape\"))","v":"40 mil"},null,1,1,1,1,1,1,null,"AC","Yellow Edge",{"$f":"IF(AN144=Results!L54,\"40 mil\",IF(AN144=Results!L60,\"90 mil\",\"Tape\"))","v":"Tape"},{"$f":"IF(AO144=Results!M54,\"40 mil\",IF(AO144=Results!M60,\"90 mil\",\"Tape\"))","v":"Tape"},{"$f":"IF(AP144=Results!N54,\"40 mil\",IF(AP144=Results!N60,\"90 mil\",\"Tape\"))","v":"Tape"},{"$f":"IF(AQ144=Results!O54,\"40 mil\",IF(AQ144=Results!O60,\"90 mil\",\"Tape\"))","v":"Tape"},{"$f":"IF(AR144=Results!P54,\"40 mil\",IF(AR144=Results!P60,\"90 mil\",\"Tape\"))","v":"40 mil"},{"$f":"IF(AS144=Results!Q54,\"40 mil\",IF(AS144=Results!Q60,\"90 mil\",\"Tape\"))","v":"40 mil"},null,1,1,1,1,1,1]
[null,null,null,null,null,null,null,null,null,null,null,null,null,null,null,null,null,null,null,null,null,null,"White Edge",{"$f":"IF(X145=Results!E55,\"40 mil\",IF(X145=Results!E61,\"90 mil\",\"Tape\"))","v":"Tape"},{"$f":"IF(Y145=Results!F55,\"40 mil\",IF(Y145=Results!F61,\"90 mil\",\"Tape\"))","v":"Tape"},{"$f":"IF(Z145=Results!G55,\"40 mil\",IF(Z145=Results!G61,\"90 mil\",\"Tape\"))","v":"Tape"},{"$f":"IF(AA145=Results!H55,\"40 mil\",IF(AA145=Results!H61,\"90 mil\",\"Tape\"))","v":"Tape"},{"$f":"IF(AB145=Results!I55,\"40 mil\",IF(AB145=Results!I61,\"90 mil\",\"Tape\"))","v":"40 mil"},{"$f":"IF(AC145=Results!J55,\"40 mil\",IF(AC145=Results!J61,\"90 mil\",\"Tape\"))","v":"40 mil"},null,1,1,1,1,1,1,null,null,"White Edge",{"$f":"IF(AN145=Results!L55,\"40 mil\",IF(AN145=Results!L61,\"90 mil\",\"Tape\"))","v":"Tape"},{"$f":"IF(AO145=Results!M55,\"40 mil\",IF(AO145=Results!M61,\"90 mil\",\"Tape\"))","v":"Tape"},{"$f":"IF(AP145=Results!N55,\"40 mil\",IF(AP145=Results!N61,\"90 mil\",\"Tape\"))","v":"Tape"},{"$f":"IF(AQ145=Results!O55,\"40 mil\",IF(AQ145=Results!O61,\"90 mil\",\"Tape\"))","v":"Tape"},{"$f":"IF(AR145=Results!P55,\"40 mil\",IF(AR145=Results!P61,\"90 mil\",\"Tape\"))","v":"Tape"},{"$f":"IF(AS145=Results!Q55,\"40 mil\",IF(AS145=Results!Q61,\"90 mil\",\"Tape\"))","v":"40 mil"},null,1,1,1,1,1,1]
[null,null,null,null,null,null,null,null,null,null,null,null,null,null,null,null,null,null,null,null,null,null,"White Lane",{"$f":"IF(X146=Results!E56,\"40 mil\",IF(X146=Results!E62,\"90 mil\",\"Tape\"))","v":"Tape"},{"$f":"IF(Y146=Results!F56,\"40 mil\",IF(Y146=Results!F62,\"90 mil\",\"Tape\"))","v":"Tape"},{"$f":"IF(Z146=Results!G56,\"40 mil\",IF(Z146=Results!G62,\"90 mil\",\"Tape\"))","v":"Tape"},{"$f":"IF(AA146=Results!H56,\"40 mil\",IF(AA146=Results!H62,\"90 mil\",\"Tape\"))","v":"Tape"},{"$f":"IF(AB146=Results!I56,\"40 mil\",IF(AB146=Results!I62,\"90 mil\",\"Tape\"))","v":"40 mil"},{"$f":"IF(AC146=Results!J56,\"40 mil\",IF(AC146=Results!J62,\"90 mil\",\"Tape\"))","v":"40 mil"},null,{"$f":"X122/(X128+(X128-X122)*L128/($H122+$I122))","v":1},{"$f":"Y122/(Y128+(Y128-Y122)*M128/($H122+$I122))","v":1},{"$f":"Z122/(Z128+(Z128-Z122)*N128/($H122+$I122))","v":1},{"$f":"AA122/(AA128+(AA128-AA122)*O128/($H122+$I122))","v":1},{"$f":"AB122/(AB128+(AB128-AB122)*P128/($H122+$I122))","v":1},{"$f":"AC122/(AC128+(AC128-AC122)*Q128/($H122+$I122))","v":{"$error":"#VALUE!"}},null,null,"White Lane",{"$f":"IF(AN146=Results!L56,\"40 mil\",IF(AN146=Results!L62,\"90 mil\",\"Tape\"))","v":"Tape"},{"$f":"IF(AO146=Results!M56,\"40 mil\",IF(AO146=Results!M62,\"90 mil\",\"Tape\"))","v":"Tape"},{"$f":"IF(AP146=Results!N56,\"40 mil\",IF(AP146=Results!N62,\"90 mil\",\"Tape\"))","v":"Tape"},{"$f":"IF(AQ146=Results!O56,\"40 mil\",IF(AQ146=Results!O62,\"90 mil\",\"Tape\"))","v":"Tape"},{"$f":"IF(AR146=Results!P56,\"40 mil\",IF(AR146=Results!P62,\"90 mil\",\"Tape\"))","v":"Tape"},{"$f":"IF(AS146=Results!Q56,\"40 mil\",IF(AS146=Results!Q62,\"90 mil\",\"Tape\"))","v":"40 mil"},null,{"$f":"X122/(X128+(X128-X122)*R128/($J122+$K122))","v":1},{"$f":"Y122/(Y128+(Y128-Y122)*S128/($J122+$K122))","v":1},1,1,1,{"$error":"#VALUE!"}]
[null,null,null,null,null,null,null,null,null,null,null,null,null,null,null,null,null,null,null,null,null,null,null,null,null,null,null,null,null,null,{"$f":"X123/(X129+(X129-X123)*L129/($H123+$I123))","v":1},1,1,1,1,{"$error":"#VALUE!"},null,null,null,null,null,null,null,null,null,null,1,{"$f":"Y123/(Y129+(Y129-Y123)*S129/($J123+$K123))","v":1},1,1,1,{"$error":"#VALUE!"}]
[null,null,null,null,null,null,null,null,null,null,null,null,null,null,null,null,null,null,null,null,null,null,null,null,null,null,null,null,null,null,1,1,1,1,1,{"$error":"#VALUE!"},null,null,null,null,null,null,null,null,null,null,1,{"$f":"Y124/(Y130+(Y130-Y124)*S130/($J124+$K124))","v":1},1,1,1,{"$error":"#VALUE!"}]
[null,null,null,null,null,null,null,null,null,null,null,null,null,null,null,null,null,null,null,null,null,null,null,null,null,null,null,null,null,null,1,1,1,1,1,{"$error":"#VALUE!"},null,null,null,null,null,null,null,null,null,null,1,{"$f":"Y125/(Y131+(Y131-Y125)*S131/($J125+$K125))","v":1},1,1,1,{"$error":"#VALUE!"}]
[null,null,null,null,null,null,null,null,null,null,null,null,null,null,null,null,null,null,null,null,null,null,null,null,null,null,null,null,null,null,1,1,1,1,1,{"$error":"#VALUE!"},null,null,null,null,null,null,null,null,null,null,1,{"$f":"Y126/(Y132+(Y132-Y126)*S132/($J126+$K126))","v":1},1,1,1,{"$error":"#VALUE!"}]
[null,null,null,null,null,null,null,null,null,null,null,null,null,null,null,null,null,null,null,null,null,null,null,null,null,null,null,null,null,null,1,1,1,1,1,{"$error":"#VALUE!"},null,null,null,null,null,null,null,null,null,null,1,{"$f":"Y127/(Y133+(Y133-Y127)*S133/($J127+$K127))","v":1},1,1,1,{"$error":"#VALUE!"}]
[null,null,null,null,null,null,null,null,null,null,null,null,null,null,null,null,null,null,null,null,null,null,null,null,null,null,null,null,null,null,{"$f":"X122/(X134+(X134-X122)*L134/($H122+$I122))","v":1},{"$f":"Y122/(Y134+(Y134-Y122)*M134/($H122+$I122))","v":1},{"$f":"Z122/(Z134+(Z134-Z122)*N134/($H122+$I122))","v":1},{"$f":"AA122/(AA134+(AA134-AA122)*O134/($H122+$I122))","v":1},{"$f":"AB122/(AB134+(AB134-AB122)*P134/($H122+$I122))","v":1},{"$f":"AC122/(AC134+(AC134-AC122)*Q134/($H122+$I122))","v":{"$error":"#VALUE!"}},null,null,null,null,null,null,null,null,null,null,{"$f":"X122/(X134+(X134-X122)*R134/($J122+$K122))","v":1},{"$f":"Y122/(Y134+(Y134-Y122)*S134/($J122+$K122))","v":1},1,1,1,{"$error":"#VALUE!"}]
[null,null,null,null,null,null,null,null,null,null,null,null,null,null,null,null,null,null,null,null,null,null,null,null,null,null,null,null,null,null,{"$f":"X123/(X135+(X135-X123)*L135/($H123+$I123))","v":1},1,1,-3.1497088797559583,-6.4578003944246495E-2,{"$error":"#VALUE!"},null,null,null,null,null,null,null,null,null,null,{"$f":"X123/(X135+(X135-X123)*R135/($J123+$K123))","v":1},{"$f":"Y123/(Y135+(Y135-Y123)*S135/($J123+$K123))","v":1},1,1.2419493286850614,3.2967923700784389,{"$error":"#VALUE!"}]
[null,null,null,null,null,null,null,null,null,null,null,null,null,null,null,null,null,null,null,null,null,null,null,null,null,null,null,null,null,null,1,1,1,-0.38712851360124817,-2.1081741629248807E-2,{"$error":"#VALUE!"},null,null,null,null,null,null,null,null,null,null,{"$f":"X124/(X136+(X136-X124)*R136/($J124+$K124))","v":1},{"$f":"Y124/(Y136+(Y136-Y124)*S136/($J124+$K124))","v":1},1,1.2586153184061593,15.086318890207826,{"$error":"#VALUE!"}]
[]
[]
[]
[null,null,null,null,null,null,null,null,null,null,null,null,null,null,null,null,null,null,null,null,null,null,null,null,null,null,null,null,null,"tape",{"$f":"X128/(X116+(X116-X128)*L116/($H128+$I128))","v":1},{"$f":"Y128/(Y116+(Y116-Y128)*M116/($H128+$I128))","v":1.0061381736281951},{"$f":"Z128/(Z116+(Z116-Z128)*N116/($H128+$I128))","v":1.0406199166099834},{"$f":"AA128/(AA116+(AA116-AA128)*O116/($H128+$I128))","v":1.1882764446539029},{"$f":"AB128/(AB116+(AB116-AB128)*P116/($H128+$I128))","v":5.3956823537970449},{"$f":"AC128/(AC116+(AC116-AC128)*Q116/($H128+$I128))","v":{"$error":"#VALUE!"}},null,null,null,null,null,null,null,null,null,"tape",{"$f":"X128/(X116+(X116-X128)*R116/($J128+$K128))","v":1},{"$f":"Y128/(Y116+(Y116-Y128)*S116/($J128+$K128))","v":1.0060516161658268},1.0290677664925418,1.0604197388251386,1.1021498503020939,{"$error":"#VALUE!"}]
[null,null,null,null,null,null,null,null,null,null,null,null,null,null,null,null,null,null,null,null,null,null,null,null,null,null,null,null,null,null,{"$f":"X129/(X117+(X117-X129)*L117/($H129+$I129))","v":1},1,1,1,1,{"$error":"#VALUE!"},null,null,null,null,null,null,null,null,null,null,1,{"$f":"Y129/(Y117+(Y117-Y129)*S117/($J129+$K129))","v":1},1,1,1,{"$error":"#VALUE!"}]
[null,null,null,null,null,null,null,null,null,null,null,null,null,null,null,null,null,null,null,null,null,null,null,null,null,null,null,null,null,null,1,1,1,1,1,{"$error":"#VALUE!"},null,null,null,null,null,null,null,null,null,null,1,{"$f":"Y130/(Y118+(Y118-Y130)*S118/($J130+$K130))","v":1},1,1,1,{"$error":"#VALUE!"}]
[null,null,null,null,null,null,null,null,null,null,null,null,null,null,null,null,null,null,null,null,null,null,null,null,null,null,null,null,null,null,1,1.1309458159606991,2.5993843768270075,-0.9979553836998396,-0.12895076010084647,{"$error":"#VALUE!"},null,null,null,null,null,null,null,null,null,null,1,{"$f":"Y131/(Y119+(Y119-Y131)*S119/($J131+$K131))","v":1.1288738523510815},1.8026111610827802,3.5706823794538298,251.28474501614539,{"$error":"#VALUE!"}]
[null,null,null,null,null,null,null,null,null,null,null,null,null,null,null,null,null,null,null,null,null,null,null,null,null,null,null,null,null,null,1,1,1,1.1017704687014047,-0.41364466113661053,{"$error":"#VALUE!"},null,null,null,null,null,null,null,null,null,null,1,{"$f":"Y132/(Y120+(Y120-Y132)*S120/($J132+$K132))","v":1},1,1.034357688180507,1.63613461638706,{"$error":"#VALUE!"}]
[null,null,null,null,null,null,null,null,null,null,null,null,null,null,null,null,null,null,null,null,null,null,null,null,null,null,null,null,null,null,1,1,1,1.1872887335293625,-0.17319132299311635,{"$error":"#VALUE!"},null,null,null,null,null,null,null,null,null,null,1,{"$f":"Y133/(Y121+(Y121-Y133)*S121/($J133+$K133))","v":1},1,1.0346869459230033,1.7056276327219722,{"$error":"#VALUE!"}]
[null,null,null,null,null,null,null,null,null,null,null,null,null,null,null,null,null,null,null,null,null,null,null,null,null,null,null,null,null,null,{"$f":"X128/(X122+(X122-X128)*L122/($H128+$I128))","v":1},{"$f":"Y128/(Y122+(Y122-Y128)*M122/($H128+$I128))","v":1},{"$f":"Z128/(Z122+(Z122-Z128)*N122/($H128+$I128))","v":1},{"$f":"AA128/(AA122+(AA122-AA128)*O122/($H128+$I128))","v":1},{"$f":"AB128/(AB122+(AB122-AB128)*P122/($H128+$I128))","v":1},{"$f":"AC128/(AC122+(AC122-AC128)*Q122/($H128+$I128))","v":{"$error":"#VALUE!"}},null,null,null,null,null,null,null,null,null,null,{"$f":"X128/(X122+(X122-X128)*R122/($J128+$K128))","v":1},{"$f":"Y128/(Y122+(Y122-Y128)*S122/($J128+$K128))","v":1},1,1,1,{"$error":"#VALUE!"}]
[null,null,null,null,null,null,null,null,null,null,null,null,null,null,null,null,null,null,null,null,null,null,null,null,null,null,null,null,null,null,{"$f":"X129/(X123+(X123-X129)*L123/($H129+$I129))","v":1},1,1,1,1,{"$error":"#VALUE!"},null,null,null,null,null,null,null,null,null,null,1,{"$f":"Y129/(Y123+(Y123-Y129)*S123/($J129+$K129))","v":1},1,1,1,{"$error":"#VALUE!"}]
[null,null,null,null,null,null,null,null,null,null,null,null,null,null,null,null,null,null,null,null,null,null,null,null,null,null,null,null,null,null,1,1,1,1,1,{"$error":"#VALUE!"},null,null,null,null,null,null,null,null,null,null,1,{"$f":"Y130/(Y124+(Y124-Y130)*S124/($J130+$K130))","v":1},1,1,1,{"$error":"#VALUE!"}]
[null,null,null,null,null,null,null,null,null,null,null,null,null,null,null,null,null,null,null,null,null,null,null,null,null,null,null,null,null,null,1,1,1,1,1,{"$error":"#VALUE!"},null,null,null,null,null,null,null,null,null,null,1,{"$f":"Y131/(Y125+(Y125-Y131)*S125/($J131+$K131))","v":1},1,1,1,{"$error":"#VALUE!"}]
[null,null,null,null,null,null,null,null,null,null,null,null,null,null,null,null,null,null,null,null,null,null,null,null,null,null,null,null,null,null,1,1,1,1,1,{"$error":"#VALUE!"},null,null,null,null,null,null,null,null,null,null,1,{"$f":"Y132/(Y126+(Y126-Y132)*S126/($J132+$K132))","v":1},1,1,1,{"$error":"#VALUE!"}]
[null,null,null,null,null,null,null,null,null,null,null,null,null,null,null,null,null,null,null,null,null,null,null,null,null,null,null,null,null,null,1,1,1,1,1,{"$error":"#VALUE!"},null,null,null,null,null,null,null,null,null,null,1,{"$f":"Y133/(Y127+(Y127-Y133)*S127/($J133+$K133))","v":1},1,1,1,{"$error":"#VALUE!"}]
[null,null,null,null,null,null,null,null,null,null,null,null,null,null,null,null,null,null,null,null,null,null,null,null,null,null,null,null,null,null,1,1,1,1,1,1,null,null,null,null,null,null,null,null,null,null,1,1,1,1,1,1]
[null,null,null,null,null,null,null,null,null,null,null,null,null,null,null,null,null,null,null,null,null,null,null,null,null,null,null,null,null,null,1,1,1,1,1,1,null,null,null,null,null,null,null,null,null,null,1,1,1,1,1,1]
[null,null,null,null,null,null,null,null,null,null,null,null,null,null,null,null,null,null,null,null,null,null,null,null,null,null,null,null,null,null,1,1,1,1,1,1,null,null,null,null,null,null,null,null,null,null,1,1,1,1,1,1]
[null,null,null,null,null,null,null,null,null,null,null,null,null,null,null,null,null,null,null,null,null,null,null,null,null,null,null,null,null,null,1,1,1,1,1,1,null,null,null,null,null,null,null,null,null,null,1,1,1,1,1,1]
[null,null,null,null,null,null,null,null,null,null,null,null,null,null,null,null,null,null,null,null,null,null,null,null,null,null,null,null,null,null,1,1,1,1,1,1,null,null,null,null,null,null,null,null,null,null,1,1,1,1,1,1]
[null,null,null,null,null,null,null,null,null,null,null,null,null,null,null,null,null,null,null,null,null,null,null,null,null,null,null,null,null,null,1,1,1,1,1,1,null,null,null,null,null,null,null,null,null,null,1,1,1,1,1,1]
[null,null,null,null,null,null,null,null,null,null,null,null,null,null,null,null,null,null,null,null,null,null,null,null,null,null,null,null,null,null,{"$f":"X128/(X134+(X134-X128)*L134/($H128+$I128))","v":1},{"$f":"Y128/(Y134+(Y134-Y128)*M134/($H128+$I128))","v":1},{"$f":"Z128/(Z134+(Z134-Z128)*N134/($H128+$I128))","v":1},{"$f":"AA128/(AA134+(AA134-AA128)*O134/($H128+$I128))","v":1},{"$f":"AB128/(AB134+(AB134-AB128)*P134/($H128+$I128))","v":1},{"$f":"AC128/(AC134+(AC134-AC128)*Q134/($H128+$I128))","v":{"$error":"#VALUE!"}},null,null,null,null,null,null,null,null,null,null,{"$f":"X128/(X134+(X134-X128)*R134/($J128+$K128))","v":1},{"$f":"Y128/(Y134+(Y134-Y128)*S134/($J128+$K128))","v":1},1,1,1,{"$error":"#VALUE!"}]
[null,null,null,null,null,null,null,null,null,null,null,null,null,null,null,null,null,null,null,null,null,null,null,null,null,null,null,null,null,null,{"$f":"X129/(X135+(X135-X129)*L135/($H129+$I129))","v":1},1,1,2.1343010738820687,-0.22722987761037972,{"$error":"#VALUE!"},null,null,null,null,null,null,null,null,null,null,{"$f":"X129/(X135+(X135-X129)*R135/($J129+$K129))","v":1},{"$f":"Y129/(Y135+(Y135-Y129)*S135/($J129+$K129))","v":1},1,1.2362699660695919,2.59361259625366,{"$error":"#VALUE!"}]
[null,null,null,null,null,null,null,null,null,null,null,null,null,null,null,null,null,null,null,null,null,null,null,null,null,null,null,null,null,null,1,1,1,10.82320413724206,-0.10303870402693002,{"$error":"#VALUE!"},null,null,null,null,null,null,null,null,null,null,{"$f":"X130/(X136+(X136-X130)*R136/($J130+$K130))","v":1},{"$f":"Y130/(Y136+(Y136-Y130)*S136/($J130+$K130))","v":1},1,1.2389812584179167,2.8884295415909693,{"$error":"#VALUE!"}]
[]
[]
[]
[null,null,null,null,null,null,null,null,null,null,null,null,null,null,null,null,null,null,null,null,null,null,null,{"$f":"($H134*X116+(X116-X134)*L116)/X134/$H116","v":5.0721847930702602},{"$f":"($H134*Y116+(Y116-Y134)*M116)/Y134/$H116","v":5.0409372376897581},4.8442397696417068,3.9900556036507928,-1.0467758603410695,{"$error":"#VALUE!"},"Inverted",{"$f":"X134/(X116+(X116-X134)*L116/($H134+$I134))","v":1},{"$f":"Y134/(Y116+(Y116-Y134)*M116/($H134+$I134))","v":1.006198759061484},{"$f":"Z134/(Z116+(Z116-Z134)*N116/($H134+$I134))","v":1.0470548598475777},{"$f":"AA134/(AA116+(AA116-AA134)*O116/($H134+$I134))","v":1.2712065436956186},{"$f":"AB134/(AB116+(AB116-AB134)*P116/($H134+$I134))","v":-4.845530915680075},{"$f":"AC134/(AC116+(AC116-AC134)*Q116/($H134+$I134))","v":{"$error":"#VALUE!"}},null,null,null,null,null,null,null,null,null,"Inverted",{"$f":"X134/(X116+(X116-X134)*R116/($J134+$K134))","v":1},{"$f":"Y134/(Y116+(Y116-Y134)*S116/($J134+$K134))","v":1.00606557881375},1.029169965440013,1.0607103404613869,1.1056914454231928,{"$error":"#VALUE!"}]
[null,null,null,null,null,null,null,null,null,null,null,null,null,null,null,null,null,null,null,null,null,null,null,{"$f":"($H135*X117+(X117-X135)*L117)/X135/$H117","v":5.0721847930702602},{"$f":"($H135*Y117+(Y117-Y135)*M117)/Y135/$H117","v":5.0721847930702602},5.0721847930702602,9.5505906510070648,101.34995352551351,{"$error":"#VALUE!"},null,{"$f":"X135/(X117+(X117-X135)*L117/($H135+$I135))","v":1},1,1,0.53108597974884653,5.0046246856871077E-2,{"$error":"#VALUE!"},null,null,null,null,null,null,null,null,null,null,{"$f":"X135/(X117+(X117-X135)*R117/($J135+$K135))","v":1},{"$f":"Y135/(Y117+(Y117-Y135)*S117/($J135+$K135))","v":1},1,0.8084923532289725,0.39935748320886821,{"$error":"#VALUE!"}]
[null,null,null,null,null,null,null,null,null,null,null,null,null,null,null,null,null,null,null,null,null,null,null,{"$f":"($H136*X118+(X118-X136)*L118)/X136/$H118","v":6.4066496163682869},{"$f":"($H136*Y118+(Y118-Y136)*M118)/Y136/$H118","v":6.4066496163682869},6.4066496163682869,16.653616821814754,252.5324761282219,{"$error":"#VALUE!"},null,1,1,1,0.38470019365259722,2.5369606771349869E-2,{"$error":"#VALUE!"},null,null,null,null,null,null,null,null,null,null,{"$f":"X136/(X118+(X118-X136)*R118/($J136+$K136))","v":1},{"$f":"Y136/(Y118+(Y118-Y136)*S118/($J136+$K136))","v":1},1,0.80629436136519039,0.37761200109090581,{"$error":"#VALUE!"}]
[null,null,null,null,null,null,null,null,null,null,null,null,null,null,null,null,null,null,null,null,null,null,{"$f":"($H136*X118)","v":5323125000}]
[null,null,null,null,null,null,null,null,null,null,null,null,null,null,null,null,null,null,null,null,null,null,{"$f":"(X118-X136)","v":0}]
[null,null,null,null,null,null,null,null,null,null,null,null,null,null,null,null,null,null,null,null,null,null,{"$f":"L118","v":70.526903758950084}]
[null,null,null,null,null,null,null,null,null,null,null,null,null,null,null,null,null,null,null,null,null,null,{"$f":"X136","v":2500000},null,null,null,null,null,null,null,{"$f":"X134/(X122+(X122-X134)*L122/($H134+$I134))","v":1},{"$f":"Y134/(Y122+(Y122-Y134)*M122/($H134+$I134))","v":1},{"$f":"Z134/(Z122+(Z122-Z134)*N122/($H134+$I134))","v":1},{"$f":"AA134/(AA122+(AA122-AA134)*O122/($H134+$I134))","v":1},{"$f":"AB134/(AB122+(AB122-AB134)*P122/($H134+$I134))","v":1},{"$f":"AC134/(AC122+(AC122-AC134)*Q122/($H134+$I134))","v":{"$error":"#VALUE!"}},null,null,null,null,null,null,null,null,null,null,{"$f":"X134/(X122+(X122-X134)*R122/($J134+$K134))","v":1},{"$f":"Y134/(Y122+(Y122-Y134)*S122/($J134+$K134))","v":1},1,1,1,{"$error":"#VALUE!"}]
[null,null,null,null,null,null,null,null,null,null,null,null,null,null,null,null,null,null,null,null,null,null,{"$f":"$H118","v":332.34999999999997},null,null,null,null,null,null,null,{"$f":"X135/(X123+(X123-X135)*L123/($H135+$I135))","v":1},1,1,0.53108597974884653,5.0046246856871077E-2,{"$error":"#VALUE!"},null,null,null,null,null,null,null,null,null,null,{"$f":"X135/(X123+(X123-X135)*R123/($J135+$K135))","v":1},{"$f":"Y135/(Y123+(Y123-Y135)*S123/($J135+$K135))","v":1},1,0.8084923532289725,0.39935748320886821,{"$error":"#VALUE!"}]
[null,null,null,null,null,null,null,null,null,null,null,null,null,null,null,null,null,null,null,null,null,null,null,null,null,null,null,null,null,null,1,1,1,0.38470019365259722,2.5369606771349869E-2,{"$error":"#VALUE!"},null,null,null,null,null,null,null,null,null,null,{"$f":"X136/(X124+(X124-X136)*R124/($J136+$K136))","v":1},{"$f":"Y136/(Y124+(Y124-Y136)*S124/($J136+$K136))","v":1},1,0.80629436136519039,0.37761200109090581,{"$error":"#VALUE!"}]
[]
[null,null,null,null,null,null,null,null,null,null,null,null,null,null,null,null,null,null,null,null,null,null,"test cal.","40/inverted",null,null,null,null,null,null,null,null,null,null,null,null,null,"tape/inverted"]
[null,null,null,null,null,null,null,null,null,null,null,null,null,null,null,null,null,null,null,null,null,null,null,null,null,null,null,null,null,null,null,null,null,null,null,null,"test cal."]
[null,null,null,null,null,null,null,null,null,null,null,null,null,null,null,null,null,null,null,null,null,null,"b diff",{"$f":"X201-X202","v":0},{"$f":"Y201-Y202","v":0},{"$f":"Z201-Z202","v":0},{"$f":"AA201-AA202","v":1895059.6573400162},7233255.9247343075,null,null,{"$f":"X134/(X128+(X128-X134)*L128/($H134+$I134))","v":1},{"$f":"Y134/(Y128+(Y128-Y134)*M128/($H134+$I134))","v":1},{"$f":"Z134/(Z128+(Z128-Z134)*N128/($H134+$I134))","v":1},{"$f":"AA134/(AA128+(AA128-AA134)*O128/($H134+$I134))","v":1},{"$f":"AB134/(AB128+(AB128-AB134)*P128/($H134+$I134))","v":1},{"$f":"AC134/(AC128+(AC128-AC134)*Q128/($H134+$I134))","v":{"$error":"#VALUE!"}},null,null,null,null,null,null,null,null,null,null,{"$f":"X134/(X128+(X128-X134)*R128/($J134+$K134))","v":1},{"$f":"Y134/(Y128+(Y128-Y134)*S128/($J134+$K134))","v":1},1,1,1,{"$error":"#VALUE!"}]
[null,null,null,null,null,null,null,null,null,null,null,null,null,null,null,null,null,null,null,null,null,null,"b90",{"$f":"X118","v":2500000},{"$f":"Y118","v":5000000},7500000,10000000,12500000,null,null,{"$f":"X135/(X129+(X129-X135)*L129/($H135+$I135))","v":1},1,1,0.53108597974884653,5.0046246856871077E-2,{"$error":"#VALUE!"},"b diff",{"$f":"AL202-AL203","v":0},{"$f":"AM202-AM203","v":0},0,1895059.6573400162,7233255.9247343075,null,null,null,null,{"$f":"X135/(X129+(X129-X135)*R129/($J135+$K135))","v":1},{"$f":"Y135/(Y129+(Y129-Y135)*S129/($J135+$K135))","v":1},1,0.8084923532289725,0.39935748320886821,{"$error":"#VALUE!"}]
[null,null,null,null,null,null,null,null,null,null,null,null,null,null,null,null,null,null,null,null,null,null,"b40",{"$f":"X136","v":2500000},{"$f":"Y136","v":5000000},7500000,8104940.3426599838,5266744.0752656925,null,null,1,1,1,0.38470019365259722,2.5369606771349869E-2,{"$error":"#VALUE!"},"b90",{"$f":"X129","v":2500000},{"$f":"Y129","v":5000000},7500000,10000000,12500000,null,null,null,null,{"$f":"X136/(X130+(X130-X136)*R130/($J136+$K136))","v":1},{"$f":"Y136/(Y130+(Y130-Y136)*S130/($J136+$K136))","v":1},1,0.80629436136519039,0.37761200109090581,{"$error":"#VALUE!"}]
[null,null,null,null,null,null,null,null,null,null,null,null,null,null,null,null,null,null,null,null,null,null,"c40",{"$f":"H136","v":2129.25},{"$f":"X203","v":2129.25},{"$f":"Y203","v":2129.25},2129.25,2129.25,null,null,null,null,null,null,null,null,"b40",{"$f":"X135","v":2500000},{"$f":"Y135","v":5000000},7500000,8104940.3426599838,5266744.0752656925]
[null,null,null,null,null,null,null,null,null,null,null,null,null,null,null,null,null,null,null,null,null,null,"cu",{"$f":"L118","v":70.526903758950084},{"$f":"M118","v":127.86745896720328},2692.8377206276123,12436.000747617014,57431.650414747659,null,null,null,null,null,null,null,null,"c40",{"$f":"J135","v":6060.4999999999991},{"$f":"AL204","v":6060.4999999999991},{"$f":"AM204","v":6060.4999999999991},{"$f":"AN204","v":6060.4999999999991},{"$f":"AO204","v":6060.4999999999991}]
[null,null,null,null,null,null,null,null,null,null,null,null,null,null,null,null,null,null,null,null,null,null,"c90",{"$f":"H118","v":332.34999999999997},{"$f":"X205","v":332.34999999999997},332.34999999999997,332.34999999999997,332.34999999999997,null,null,null,null,null,null,null,null,"cu",{"$f":"R135","v":20.227999999999998},{"$f":"S135","v":39.878},59.528000000000006,79.177999999999997,576.48878080473003]
[null,null,null,null,null,null,null,null,null,null,null,null,null,null,null,null,null,null,null,null,null,null,"factor",{"$f":"(X201*X203+X200*X204)/X202/X205","v":6.4066496163682869},{"$f":"(Y201*Y203+Y200*Y204)/Y202/Y205","v":6.4066496163682869},{"$f":"(Z201*Z203+Z200*Z204)/Z202/Z205","v":6.4066496163682869},{"$f":"(AA201*AA203+AA200*AA204)/AA202/AA205","v":16.653616821814754},252.5324761282219,null,null,1,1,1,1,1,1,"c90",{"$f":"J129","v":9324.1999999999989},{"$f":"AL206","v":9324.1999999999989},{"$f":"AM206","v":9324.1999999999989},{"$f":"AN206","v":9324.1999999999989},{"$f":"AO206","v":9324.1999999999989},null,null,null,null,1,1,1,1,1,1]
[null,null,null,null,null,null,null,null,null,null,null,null,null,null,null,null,null,null,null,null,null,null,null,null,null,null,null,null,null,null,1,1,1,1,1,1,"factor",{"$f":"(AL202*AL204+AL201*AL205)/AL203/AL206","v":0.64997533300443999},{"$f":"(AM202*AM204+AM201*AM205)/AM203/AM206","v":0.64997533300443999},{"$f":"(AN202*AN204+AN201*AN205)/AN203/AN206","v":0.64997533300443999},{"$f":"(AO202*AO204+AO201*AO205)/AO203/AO206","v":0.80393504083069667},1.6275526572879968,null,null,null,null,1,1,1,1,1,1]
[null,null,null,null,null,null,null,null,null,null,null,null,null,null,null,null,null,null,null,null,null,null,null,null,null,null,null,null,null,null,1,1,1,1,1,1,null,null,null,null,null,null,null,null,null,null,1,1,1,1,1,1]
[null,null,null,null,null,null,null,null,null,null,null,null,null,null,null,null,null,null,null,null,null,null,null,null,null,null,null,null,null,null,null,null,null,null,null,null,"recal",{"$f":"(X129*J135+(X129-X135)*R129)/X135/J129","v":0.64997533300443999}]

{"sheet":"Factors for Restripe-PCC","index":11,"n_rows":64,"n_cols":28,"rows_kept":64,"cut":false,"hidden":true,"merged":[[46,0,49,0],[50,0,53,0],[54,0,57,0],[58,0,61,0],[33,0,36,0],[37,0,40,0],[42,0,42,13],[43,0,45,0],[43,1,45,1],[43,2,43,7],[43,8,43,13],[44,2,44,6],[44,8,44,12],[44,16,44,20],[44,22,44,26],[42,15,42,27],[43,15,45,15],[43,16,43,21],[43,22,43,27],[22,15,24,15],[22,16,22,21],[22,22,22,27],[23,16,23,20],[23,22,23,26],[0,15,0,27],[1,15,3,15],[1,16,1,21],[2,16,2,20],[21,15,21,27],[1,8,1,13],[2,8,2,12],[1,1,3,1],[1,22,1,27],[2,22,2,26],[1,0,3,0],[29,0,32,0],[4,0,7,0],[8,0,11,0],[12,0,15,0],[16,0,19,0],[21,0,21,13],[22,0,24,0],[22,1,24,1],[22,2,22,7],[25,0,28,0],[22,8,22,13],[23,2,23,6],[23,8,23,12],[2,2,2,6],[1,2,1,7]]}
["Equivalent Cost Factors for Restripe-PCC",null,null,null,"Yellow Edge Line",null,null,null,null,null,null,null,null,null,null,"Bidding Factors for Restripe-PCC: Yellow Edge Line"]
["Reference Material","Material","Off-Peak Application",null,null,null,null,null,"Night Time Application",null,null,null,null,null,null,"Material","Off-Peak Application",null,null,null,null,null,"Night Time Application"]
[null,null,"ADT per Lane",null,null,null,null,"User ADT","ADT per Lane",null,null,null,null,"User ADT",null,null,"ADT per Lane",null,null,null,null,"User ADT","ADT per Lane",null,null,null,null,"User ADT"]
[null,null,5000,10000,15000,20000,25000,{"$f":"IF(Input!$B$33=\"No\",\"\",Input!$B$33)","v":""},5000,10000,15000,20000,25000,{"$f":"IF(Input!$B$33=\"No\",\"\",Input!$B$33)","v":""},null,null,"5000",10000,15000,20000,25000,{"$f":"IF(Input!$B$33=\"No\",\"\",Input!$B$33)","v":""},5000,10000,15000,20000,25000,{"$f":"IF(Input!$B$33=\"No\",\"\",Input!$B$33)","v":""}]
["40 mil","40 mil",1,1,1,1,1,{"$f":"IF(Input!$B$33=\"No\",\"\",1)","v":""},1,1,1,1,1,{"$f":"IF(Input!$B$33=\"No\",\"\",1)","v":""},null,"40 mil",{"$f":"IF(MIN(Results!E6,Results!E12)=Results!E6,1,'Factor Results'!AE30)","v":1},{"$f":"IF(MIN(Results!F6,Results!F12)=Results!F6,1,'Factor Results'!AF30)","v":1.0061440115879521},{"$f":"IF(MIN(Results!G6,Results!G12)=Results!G6,1,'Factor Results'!AG30)","v":1.0412365701171009},{"$f":"IF(MIN(Results!H6,Results!H12)=Results!H6,1,'Factor Results'!AH30)","v":1.1957938660380694},{"$f":"IF(MIN(Results!I6,Results!I12)=Results!I6,1,'Factor Results'!AI30)","v":1},{"$f":"IF(MIN(Results!J6,Results!J12)=Results!J6,1,'Factor Results'!AJ30)","v":1},{"$f":"IF(MIN(Results!L6,Results!L12)=Results!L6,1,'Factor Results'!AU30)","v":1},{"$f":"IF(MIN(Results!M6,Results!M12)=Results!M6,1,'Factor Results'!AV30)","v":1.0060529616507945},{"$f":"IF(MIN(Results!N6,Results!N12)=Results!N6,1,'Factor Results'!AW30)","v":1.0290776139465201},{"$f":"IF(MIN(Results!O6,Results!O12)=Results!O6,1,'Factor Results'!AX30)","v":1.0604477355372266},{"$f":"IF(MIN(Results!P6,Results!P12)=Results!P6,1,'Factor Results'!AY30)","v":1.1024901457870917},{"$f":"IF(MIN(Results!Q6,Results!Q12)=Results!Q6,1,'Factor Results'!AZ30)","v":1}]
[null,"90 mil",{"$f":"Q6/Q5","v":1},{"$f":"R6/R5","v":0.9938935067771707},0.96039654070883884,0.83626453388092892,0.47101390048704794,{"$f":"IF(Input!$B$33=\"No\",\"\",V6/V5)","v":""},{"$f":"W6/W5","v":1},{"$f":"X6/X5","v":0.99398345625774764},{"$f":"Y6/Y5","v":0.9717440030251876},{"$f":"Z6/Z5","v":0.94299791162588176},{"$f":"AA6/AA5","v":0.9070375856158589},{"$f":"IF(Input!$B$33=\"No\",\"\",AB6/AB5)","v":""},null,"90 mil",{"$f":"IF(MIN(Results!E6,Results!E12)=Results!E6,'Factor Results'!AE12,1)","v":1},{"$f":"IF(MIN(Results!F6,Results!F12)=Results!F6,'Factor Results'!AF12,1)","v":1},{"$f":"IF(MIN(Results!G6,Results!G12)=Results!G6,'Factor Results'!AG12,1)","v":1},{"$f":"IF(MIN(Results!H6,Results!H12)=Results!H6,'Factor Results'!AH12,1)","v":1},{"$f":"IF(MIN(Results!I6,Results!I12)=Results!I6,'Factor Results'!AI12,1)","v":0.47101390048704794},{"$f":"IF(MIN(Results!J6,Results!J12)=Results!J6,'Factor Results'!AJ12,1)","v":{"$error":"#VALUE!"}},{"$f":"IF(MIN(Results!L6,Results!L12)=Results!L6,'Factor Results'!AU12,1)","v":1},{"$f":"IF(MIN(Results!M6,Results!M12)=Results!M6,'Factor Results'!AV12,1)","v":1},{"$f":"IF(MIN(Results!N6,Results!N12)=Results!N6,'Factor Results'!AW12,1)","v":1},{"$f":"IF(MIN(Results!O6,Results!O12)=Results!O6,'Factor Results'!AX12,1)","v":1},{"$f":"IF(MIN(Results!P6,Results!P12)=Results!P6,'Factor Results'!AY12,1)","v":1},{"$f":"IF(MIN(Results!Q6,Results!Q12)=Results!Q6,'Factor Results'!AZ12,1)","v":{"$error":"#VALUE!"}}]
[null,"Tape",{"$f":"Q8/Q7","v":1},{"$f":"R8/R7","v":0.99394294969369323},0.96527587323897723,0.88162273715074224,0.47121072603076386,{"$f":"IF(Input!$B$33=\"No\",\"\",V8/V7)","v":""},{"$f":"W8/W7","v":1},{"$f":"X8/X7","v":0.99399485346643512},{"$f":"Y8/Y7","v":0.9718237276733549},{"$f":"Z8/Z7","v":0.94321136386567672},{"$f":"AA8/AA7","v":0.90943863770556688},{"$f":"IF(Input!$B$33=\"No\",\"\",AB8/AB7)","v":""},null,"40 mil",{"$f":"IF(MIN(Results!E6,Results!E18)=Results!E6,1,'Factor Results'!AE54)","v":1},{"$f":"IF(MIN(Results!F6,Results!F18)=Results!F6,1,'Factor Results'!AF54)","v":1.0060939617391254},{"$f":"IF(MIN(Results!G6,Results!G18)=Results!G6,1,'Factor Results'!AG54)","v":1.0359732670459338},{"$f":"IF(MIN(Results!H6,Results!H18)=Results!H6,1,'Factor Results'!AH54)","v":1.1342720166585465},{"$f":"IF(MIN(Results!I6,Results!I18)=Results!I6,1,'Factor Results'!AI54)","v":2.1221927786395787},{"$f":"IF(MIN(Results!J6,Results!J18)=Results!J6,1,'Factor Results'!AJ54)","v":1},{"$f":"IF(MIN(Results!L6,Results!L18)=Results!L6,1,'Factor Results'!AU54)","v":1},{"$f":"IF(MIN(Results!M6,Results!M18)=Results!M6,1,'Factor Results'!AV54)","v":1.0060414261830659},{"$f":"IF(MIN(Results!N6,Results!N18)=Results!N6,1,'Factor Results'!AW54)","v":1.0289931924116547},{"$f":"IF(MIN(Results!O6,Results!O18)=Results!O6,1,'Factor Results'!AX54)","v":1.0602077522704769},{"$f":"IF(MIN(Results!P6,Results!P18)=Results!P6,1,'Factor Results'!AY54)","v":1.0995794092528457},{"$f":"IF(MIN(Results!Q6,Results!Q18)=Results!Q6,1,'Factor Results'!AZ54)","v":1}]
[null,"Inverted",{"$f":"Q10/Q9","v":1},{"$f":"R10/R9","v":0.99392475293691185},0.96348010483469293,0.86492930053744843,0.47101390048704794,{"$f":"IF(Input!$B$33=\"No\",\"\",V10/V9)","v":""},{"$f":"W10/W9","v":1},{"$f":"X10/X9","v":0.99399065888712912},{"$f":"Y10/Y9","v":0.97179438615925684},{"$f":"Z10/Z9","v":0.94313280582814174},{"$f":"AA10/AA9","v":0.90855496489722554},{"$f":"IF(Input!$B$33=\"No\",\"\",AB10/AB9)","v":""},null,"Tape",{"$f":"IF(MIN(Results!E6,Results!E18)=Results!E6,'Factor Results'!AE18,1)","v":1},{"$f":"IF(MIN(Results!F6,Results!F18)=Results!F6,'Factor Results'!AF18,1)","v":1},{"$f":"IF(MIN(Results!G6,Results!G18)=Results!G6,'Factor Results'!AG18,1)","v":1},{"$f":"IF(MIN(Results!H6,Results!H18)=Results!H6,'Factor Results'!AH18,1)","v":1},{"$f":"IF(MIN(Results!I6,Results!I18)=Results!I6,'Factor Results'!AI18,1)","v":1},{"$f":"IF(MIN(Results!J6,Results!J18)=Results!J6,'Factor Results'!AJ18,1)","v":{"$error":"#VALUE!"}},{"$f":"IF(MIN(Results!L6,Results!L18)=Results!L6,'Factor Results'!AU18,1)","v":1},{"$f":"IF(MIN(Results!M6,Results!M18)=Results!M6,'Factor Results'!AV18,1)","v":1},{"$f":"IF(MIN(Results!N6,Results!N18)=Results!N6,'Factor Results'!AW18,1)","v":1},{"$f":"IF(MIN(Results!O6,Results!O18)=Results!O6,'Factor Results'!AX18,1)","v":1},{"$f":"IF(MIN(Results!P6,Results!P18)=Results!P6,'Factor Results'!AY18,1)","v":1},{"$f":"IF(MIN(Results!Q6,Results!Q18)=Results!Q6,'Factor Results'!AZ18,1)","v":{"$error":"#VALUE!"}}]
["90 mil","40 mil",{"$f":"Q5/Q6","v":1},{"$f":"R5/R6","v":1.0061440115879521},{"$f":"S5/S6","v":1.0412365701171009},{"$f":"T5/T6","v":1.1957938660380694},{"$f":"U5/U6","v":2.1230795926955839},{"$f":"IF(Input!$B$33=\"No\",\"\",V5/V6)","v":""},{"$f":"W5/W6","v":1},{"$f":"X5/X6","v":1.0060529616507945},{"$f":"Y5/Y6","v":1.0290776139465201},{"$f":"Z5/Z6","v":1.0604477355372266},{"$f":"AA5/AA6","v":1.1024901457870917},{"$f":"IF(Input!$B$33=\"No\",\"\",AB5/AB6)","v":""},null,"40 mil",{"$f":"IF(MIN(Results!E6,Results!E24)=Results!E6,1,'Factor Results'!AE78)","v":1},{"$f":"IF(MIN(Results!F6,Results!F24)=Results!F6,1,'Factor Results'!AF78)","v":1.006112381289566},{"$f":"IF(MIN(Results!G6,Results!G24)=Results!G6,1,'Factor Results'!AG78)","v":1.0379041507780515},{"$f":"IF(MIN(Results!H6,Results!H24)=Results!H6,1,'Factor Results'!AH78)","v":1.1561638614608403},{"$f":"IF(MIN(Results!I6,Results!I24)=Results!I6,1,'Factor Results'!AI78)","v":1},{"$f":"IF(MIN(Results!J6,Results!J24)=Results!J6,1,'Factor Results'!AJ78)","v":1},{"$f":"IF(MIN(Results!L6,Results!L24)=Results!L6,1,'Factor Results'!AU78)","v":1},{"$f":"IF(MIN(Results!M6,Results!M24)=Results!M6,1,'Factor Results'!AV78)","v":1.006045671615867},{"$f":"IF(MIN(Results!N6,Results!N24)=Results!N6,1,'Factor Results'!AW78)","v":1.0290242609367377},{"$f":"IF(MIN(Results!O6,Results!O24)=Results!O6,1,'Factor Results'!AX78)","v":1.0602960620396664},{"$f":"IF(MIN(Results!P6,Results!P24)=Results!P6,1,'Factor Results'!AY78)","v":1.1006488750112313},{"$f":"IF(MIN(Results!Q6,Results!Q24)=Results!Q6,1,'Factor Results'!AZ78)","v":1}]
[null,"90 mil",1,1,1,1,1,{"$f":"IF(Input!$B$33=\"No\",\"\",1)","v":""},1,1,1,1,1,{"$f":"IF(Input!$B$33=\"No\",\"\",1)","v":""},null,"Inverted",{"$f":"IF(MIN(Results!E6,Results!E24)=Results!E6,'Factor Results'!AE24,1)","v":1},{"$f":"IF(MIN(Results!F6,Results!F24)=Results!F6,'Factor Results'!AF24,1)","v":1},{"$f":"IF(MIN(Results!G6,Results!G24)=Results!G6,'Factor Results'!AG24,1)","v":1},{"$f":"IF(MIN(Results!H6,Results!H24)=Results!H6,'Factor Results'!AH24,1)","v":1},{"$f":"IF(MIN(Results!I6,Results!I24)=Results!I6,'Factor Results'!AI24,1)","v":0.47101390048704794},{"$f":"IF(MIN(Results!J6,Results!J24)=Results!J6,'Factor Results'!AJ24,1)","v":{"$error":"#VALUE!"}},{"$f":"IF(MIN(Results!L6,Results!L24)=Results!L6,'Factor Results'!AU24,1)","v":1},{"$f":"IF(MIN(Results!M6,Results!M24)=Results!M6,'Factor Results'!AV24,1)","v":1},{"$f":"IF(MIN(Results!N6,Results!N24)=Results!N6,'Factor Results'!AW24,1)","v":1},{"$f":"IF(MIN(Results!O6,Results!O24)=Results!O6,'Factor Results'!AX24,1)","v":1},{"$f":"IF(MIN(Results!P6,Results!P24)=Results!P6,'Factor Results'!AY24,1)","v":1},{"$f":"IF(MIN(Results!Q6,Results!Q24)=Results!Q6,'Factor Results'!AZ24,1)","v":{"$error":"#VALUE!"}}]
[null,"Tape",{"$f":"Q12/Q11","v":1},{"$f":"R12/R11","v":1},1,1,1,{"$f":"IF(Input!$B$33=\"No\",\"\",V12/V11)","v":""},{"$f":"W12/W11","v":1},{"$f":"X12/X11","v":1},{"$f":"Y12/Y11","v":1},{"$f":"Z12/Z11","v":1},{"$f":"AA12/AA11","v":1},{"$f":"IF(Input!$B$33=\"No\",\"\",AB12/AB11)","v":""},null,"90 mil",{"$f":"IF(MIN(Results!E12,Results!E18)=Results!E12,1,'Factor Results'!AE60)","v":1},{"$f":"IF(MIN(Results!F12,Results!F18)=Results!F12,1,'Factor Results'!AF60)","v":1},{"$f":"IF(MIN(Results!G12,Results!G18)=Results!G12,1,'Factor Results'!AG60)","v":1},{"$f":"IF(MIN(Results!H12,Results!H18)=Results!H12,1,'Factor Results'!AH60)","v":1},{"$f":"IF(MIN(Results!I12,Results!I18)=Results!I12,1,'Factor Results'!AI60)","v":1},{"$f":"IF(MIN(Results!J12,Results!J18)=Results!J12,1,'Factor Results'!AJ60)","v":1},{"$f":"IF(MIN(Results!L12,Results!L18)=Results!L12,1,'Factor Results'!AU60)","v":1},{"$f":"IF(MIN(Results!M12,Results!M18)=Results!M12,1,'Factor Results'!AV60)","v":1},{"$f":"IF(MIN(Results!N12,Results!N18)=Results!N12,1,'Factor Results'!AW60)","v":1},{"$f":"IF(MIN(Results!O12,Results!O18)=Results!O12,1,'Factor Results'!AX60)","v":1},{"$f":"IF(MIN(Results!P12,Results!P18)=Results!P12,1,'Factor Results'!AY60)","v":1},{"$f":"IF(MIN(Results!Q12,Results!Q18)=Results!Q12,1,'Factor Results'!AZ60)","v":1}]
[null,"Inverted",{"$f":"Q14/Q13","v":1},{"$f":"R14/R13","v":1},1,1,1,{"$f":"IF(Input!$B$33=\"No\",\"\",V14/V13)","v":""},{"$f":"W14/W13","v":1},{"$f":"X14/X13","v":1},{"$f":"Y14/Y13","v":1},{"$f":"Z14/Z13","v":1},{"$f":"AA14/AA13","v":1},{"$f":"IF(Input!$B$33=\"No\",\"\",AB14/AB13)","v":""},null,"Tape",{"$f":"IF(MIN(Results!E12,Results!E18)=Results!E12,'Factor Results'!AE42,1)","v":1},{"$f":"IF(MIN(Results!F12,Results!F18)=Results!F12,'Factor Results'!AF42,1)","v":1},{"$f":"IF(MIN(Results!G12,Results!G18)=Results!G12,'Factor Results'!AG42,1)","v":1},{"$f":"IF(MIN(Results!H12,Results!H18)=Results!H12,'Factor Results'!AH42,1)","v":1},{"$f":"IF(MIN(Results!I12,Results!I18)=Results!I12,'Factor Results'!AI42,1)","v":1},{"$f":"IF(MIN(Results!J12,Results!J18)=Results!J12,'Factor Results'!AJ42,1)","v":{"$error":"#VALUE!"}},{"$f":"IF(MIN(Results!L12,Results!L18)=Results!L12,'Factor Results'!AU42,1)","v":1},{"$f":"IF(MIN(Results!M12,Results!M18)=Results!M12,'Factor Results'!AV42,1)","v":1},{"$f":"IF(MIN(Results!N12,Results!N18)=Results!N12,'Factor Results'!AW42,1)","v":1},{"$f":"IF(MIN(Results!O12,Results!O18)=Results!O12,'Factor Results'!AX42,1)","v":1},{"$f":"IF(MIN(Results!P12,Results!P18)=Results!P12,'Factor Results'!AY42,1)","v":1},{"$f":"IF(MIN(Results!Q12,Results!Q18)=Results!Q12,'Factor Results'!AZ42,1)","v":{"$error":"#VALUE!"}}]
["Tape","40 mil",{"$f":"Q7/Q8","v":1},{"$f":"R7/R8","v":1.0060939617391254},{"$f":"S7/S8","v":1.0359732670459338},{"$f":"T7/T8","v":1.1342720166585465},{"$f":"U7/U8","v":2.1221927786395787},{"$f":"IF(Input!$B$33=\"No\",\"\",V7/V8)","v":""},{"$f":"W7/W8","v":1},{"$f":"X7/X8","v":1.0060414261830659},{"$f":"Y7/Y8","v":1.0289931924116547},{"$f":"Z7/Z8","v":1.0602077522704769},{"$f":"AA7/AA8","v":1.0995794092528457},{"$f":"IF(Input!$B$33=\"No\",\"\",AB7/AB8)","v":""},null,"90 mil",{"$f":"IF(MIN(Results!E12,Results!E24)=Results!E12,1,'Factor Results'!AE84)","v":1},{"$f":"IF(MIN(Results!F12,Results!F24)=Results!F12,1,'Factor Results'!AF84)","v":1},{"$f":"IF(MIN(Results!G12,Results!G24)=Results!G12,1,'Factor Results'!AG84)","v":1},{"$f":"IF(MIN(Results!H12,Results!H24)=Results!H12,1,'Factor Results'!AH84)","v":1},{"$f":"IF(MIN(Results!I12,Results!I24)=Results!I12,1,'Factor Results'!AI84)","v":1},{"$f":"IF(MIN(Results!J12,Results!J24)=Results!J12,1,'Factor Results'!AJ84)","v":1},{"$f":"IF(MIN(Results!L12,Results!L24)=Results!L12,1,'Factor Results'!AU84)","v":1},{"$f":"IF(MIN(Results!M12,Results!M24)=Results!M12,1,'Factor Results'!AV84)","v":1},{"$f":"IF(MIN(Results!N12,Results!N24)=Results!N12,1,'Factor Results'!AW84)","v":1},{"$f":"IF(MIN(Results!O12,Results!O24)=Results!O12,1,'Factor Results'!AX84)","v":1},{"$f":"IF(MIN(Results!P12,Results!P24)=Results!P12,1,'Factor Results'!AY84)","v":1},{"$f":"IF(MIN(Results!Q12,Results!Q24)=Results!Q12,1,'Factor Results'!AZ84)","v":1}]
[null,"90 mil",{"$f":"Q11/Q12","v":1},{"$f":"R11/R12","v":1},{"$f":"S11/S12","v":1},{"$f":"T11/T12","v":1},{"$f":"U11/U12","v":1},{"$f":"IF(Input!$B$33=\"No\",\"\",V11/V12)","v":""},{"$f":"W11/W12","v":1},{"$f":"X11/X12","v":1},{"$f":"Y11/Y12","v":1},{"$f":"Z11/Z12","v":1},{"$f":"AA11/AA12","v":1},{"$f":"IF(Input!$B$33=\"No\",\"\",AB11/AB12)","v":""},null,"Inverted",{"$f":"IF(MIN(Results!E12,Results!E24)=Results!E12,'Factor Results'!AE48,1)","v":1},{"$f":"IF(MIN(Results!F12,Results!F24)=Results!F12,'Factor Results'!AF48,1)","v":1},{"$f":"IF(MIN(Results!G12,Results!G24)=Results!G12,'Factor Results'!AG48,1)","v":1},{"$f":"IF(MIN(Results!H12,Results!H24)=Results!H12,'Factor Results'!AH48,1)","v":1},{"$f":"IF(MIN(Results!I12,Results!I24)=Results!I12,'Factor Results'!AI48,1)","v":1},{"$f":"IF(MIN(Results!J12,Results!J24)=Results!J12,'Factor Results'!AJ48,1)","v":{"$error":"#VALUE!"}},{"$f":"IF(MIN(Results!L12,Results!L24)=Results!L12,'Factor Results'!AU48,1)","v":1},{"$f":"IF(MIN(Results!M12,Results!M24)=Results!M12,'Factor Results'!AV48,1)","v":1},{"$f":"IF(MIN(Results!N12,Results!N24)=Results!N12,'Factor Results'!AW48,1)","v":1},{"$f":"IF(MIN(Results!O12,Results!O24)=Results!O12,'Factor Results'!AX48,1)","v":1},{"$f":"IF(MIN(Results!P12,Results!P24)=Results!P12,'Factor Results'!AY48,1)","v":1},{"$f":"IF(MIN(Results!Q12,Results!Q24)=Results!Q12,'Factor Results'!AZ48,1)","v":{"$error":"#VALUE!"}}]
[null,"Tape",1,1,1,1,1,{"$f":"IF(Input!$B$33=\"No\",\"\",1)","v":""},1,1,1,1,1,{"$f":"IF(Input!$B$33=\"No\",\"\",1)","v":""},null,"Tape",{"$f":"IF(MIN(Results!E18,Results!E24)=Results!E18,1,'Factor Results'!AE90)","v":1},{"$f":"IF(MIN(Results!F18,Results!F24)=Results!F18,1,'Factor Results'!AF90)","v":1},{"$f":"IF(MIN(Results!G18,Results!G24)=Results!G18,1,'Factor Results'!AG90)","v":1},{"$f":"IF(MIN(Results!H18,Results!H24)=Results!H18,1,'Factor Results'!AH90)","v":1},{"$f":"IF(MIN(Results!I18,Results!I24)=Results!I18,1,'Factor Results'!AI90)","v":1},{"$f":"IF(MIN(Results!J18,Results!J24)=Results!J18,1,'Factor Results'!AJ90)","v":1},{"$f":"IF(MIN(Results!L18,Results!L24)=Results!L18,1,'Factor Results'!AU90)","v":1},{"$f":"IF(MIN(Results!M18,Results!M24)=Results!M18,1,'Factor Results'!AV90)","v":1},{"$f":"IF(MIN(Results!N18,Results!N24)=Results!N18,1,'Factor Results'!AW90)","v":1},{"$f":"IF(MIN(Results!O18,Results!O24)=Results!O18,1,'Factor Results'!AX90)","v":1},{"$f":"IF(MIN(Results!P18,Results!P24)=Results!P18,1,'Factor Results'!AY90)","v":1},{"$f":"IF(MIN(Results!Q18,Results!Q24)=Results!Q18,1,'Factor Results'!AZ90)","v":1}]
[null,"Inverted",{"$f":"Q16/Q15","v":1},{"$f":"R16/R15","v":1},1,1,1,{"$f":"IF(Input!$B$33=\"No\",\"\",V16/V15)","v":""},{"$f":"W16/W15","v":1},{"$f":"X16/X15","v":1},{"$f":"Y16/Y15","v":1},{"$f":"Z16/Z15","v":1},{"$f":"AA16/AA15","v":1},{"$f":"IF(Input!$B$33=\"No\",\"\",AB16/AB15)","v":""},null,"Inverted",{"$f":"IF(MIN(Results!E18,Results!E24)=Results!E18,'Factor Results'!AE72,1)","v":1},{"$f":"IF(MIN(Results!F18,Results!F24)=Results!F18,'Factor Results'!AF72,1)","v":1},{"$f":"IF(MIN(Results!G18,Results!G24)=Results!G18,'Factor Results'!AG72,1)","v":1},{"$f":"IF(MIN(Results!H18,Results!H24)=Results!H18,'Factor Results'!AH72,1)","v":1},{"$f":"IF(MIN(Results!I18,Results!I24)=Results!I18,'Factor Results'!AI72,1)","v":1},{"$f":"IF(MIN(Results!J18,Results!J24)=Results!J18,'Factor Results'!AJ72,1)","v":{"$error":"#VALUE!"}},{"$f":"IF(MIN(Results!L18,Results!L24)=Results!L18,'Factor Results'!AU72,1)","v":1},{"$f":"IF(MIN(Results!M18,Results!M24)=Results!M18,'Factor Results'!AV72,1)","v":1},{"$f":"IF(MIN(Results!N18,Results!N24)=Results!N18,'Factor Results'!AW72,1)","v":1},{"$f":"IF(MIN(Results!O18,Results!O24)=Results!O18,'Factor Results'!AX72,1)","v":1},{"$f":"IF(MIN(Results!P18,Results!P24)=Results!P18,'Factor Results'!AY72,1)","v":1},{"$f":"IF(MIN(Results!Q18,Results!Q24)=Results!Q18,'Factor Results'!AZ72,1)","v":{"$error":"#VALUE!"}}]
["Inverted","40 mil",{"$f":"Q9/Q10","v":1},{"$f":"R9/R10","v":1.006112381289566},{"$f":"S9/S10","v":1.0379041507780515},{"$f":"T9/T10","v":1.1561638614608403},{"$f":"U9/U10","v":2.1230795926955839},{"$f":"IF(Input!$B$33=\"No\",\"\",V9/V10)","v":""},{"$f":"W9/W10","v":1},{"$f":"X9/X10","v":1.006045671615867},{"$f":"Y9/Y10","v":1.0290242609367377},{"$f":"Z9/Z10","v":1.0602960620396664},{"$f":"AA9/AA10","v":1.1006488750112313},{"$f":"IF(Input!$B$33=\"No\",\"\",AB9/AB10)","v":""}]
[null,"90 mil",{"$f":"Q13/Q14","v":1},{"$f":"R13/R14","v":1},{"$f":"S13/S14","v":1},{"$f":"T13/T14","v":1},{"$f":"U13/U14","v":1},{"$f":"IF(Input!$B$33=\"No\",\"\",V13/V14)","v":""},{"$f":"W13/W14","v":1},{"$f":"X13/X14","v":1},{"$f":"Y13/Y14","v":1},{"$f":"Z13/Z14","v":1},{"$f":"AA13/AA14","v":1},{"$f":"IF(Input!$B$33=\"No\",\"\",AB13/AB14)","v":""}]
[null,"Tape",{"$f":"Q15/Q16","v":1},{"$f":"R15/R16","v":1},{"$f":"S15/S16","v":1},{"$f":"T15/T16","v":1},{"$f":"U15/U16","v":1},{"$f":"IF(Input!$B$33=\"No\",\"\",V15/V16)","v":""},{"$f":"W15/W16","v":1},{"$f":"X15/X16","v":1},{"$f":"Y15/Y16","v":1},{"$f":"Z15/Z16","v":1},{"$f":"AA15/AA16","v":1},{"$f":"IF(Input!$B$33=\"No\",\"\",AB15/AB16)","v":""}]
[null,"Inverted",1,1,1,1,1,{"$f":"IF(Input!$B$33=\"No\",\"\",1)","v":""},1,1,1,1,1,{"$f":"IF(Input!$B$33=\"No\",\"\",1)","v":""}]
[]
["Bidding Factors for Restripe-PCC: White Edge Line",null,null,null,null,null,null,null,null,null,null,null,null,null,null,"Bidding Factors for Restripe-PCC: White Edge Line"]
["Reference Material","Material","Off-Peak Application",null,null,null,null,null,"Night Time Application",null,null,null,null,null,null,"Material","Off-Peak Application",null,null,null,null,null,"Night Time Application"]
[null,null,"ADT per Lane",null,null,null,null,"User ADT","ADT per Lane",null,null,null,null,"User ADT",null,null,"ADT per Lane",null,null,null,null,"User ADT","ADT per Lane",null,null,null,null,"User ADT"]
[null,null,5000,10000,15000,20000,25000,{"$f":"IF(Input!$B$33=\"No\",\"\",Input!$B$33)","v":""},5000,10000,15000,20000,25000,{"$f":"IF(Input!$B$33=\"No\",\"\",Input!$B$33)","v":""},null,null,5000,10000,15000,20000,25000,{"$f":"IF(Input!$B$33=\"No\",\"\",Input!$B$33)","v":""},5000,10000,15000,20000,25000,{"$f":"IF(Input!$B$33=\"No\",\"\",Input!$B$33)","v":""}]
["40 mil","40 mil",1,1,1,1,1,{"$f":"IF(Input!$B$33=\"No\",\"\",1)","v":""},1,1,1,1,1,{"$f":"IF(Input!$B$33=\"No\",\"\",1)","v":""},null,"40 mil",{"$f":"IF(MIN(Results!E7,Results!E13)=Results!E7,1,'Factor Results'!AE31)","v":1},{"$f":"IF(MIN(Results!F7,Results!F13)=Results!F7,1,'Factor Results'!AF31)","v":1},{"$f":"IF(MIN(Results!G7,Results!G13)=Results!G7,1,'Factor Results'!AG31)","v":1},{"$f":"IF(MIN(Results!H7,Results!H13)=Results!H7,1,'Factor Results'!AH31)","v":1},{"$f":"IF(MIN(Results!I7,Results!I13)=Results!I7,1,'Factor Results'!AI31)","v":1},{"$f":"IF(MIN(Results!J7,Results!J13)=Results!J7,1,'Factor Results'!AJ31)","v":1},{"$f":"IF(MIN(Results!L7,Results!L13)=Results!L7,1,'Factor Results'!AU31)","v":1},{"$f":"IF(MIN(Results!M7,Results!M13)=Results!M7,1,'Factor Results'!AV31)","v":1},{"$f":"IF(MIN(Results!N7,Results!N13)=Results!N7,1,'Factor Results'!AW31)","v":1},{"$f":"IF(MIN(Results!O7,Results!O13)=Results!O7,1,'Factor Results'!AX31)","v":1},{"$f":"IF(MIN(Results!P7,Results!P13)=Results!P7,1,'Factor Results'!AY31)","v":1},{"$f":"IF(MIN(Results!Q7,Results!Q13)=Results!Q7,1,'Factor Results'!AZ31)","v":1}]
[null,"90 mil",{"$f":"Q27/Q26","v":1},{"$f":"R27/R26","v":1},{"$f":"S27/S26","v":1},{"$f":"T27/T26","v":1},{"$f":"U27/U26","v":1},{"$f":"IF(Input!$B$33=\"No\",\"\",V27/V26)","v":""},{"$f":"W27/W26","v":1},{"$f":"X27/X26","v":1},{"$f":"Y27/Y26","v":1},{"$f":"Z27/Z26","v":1},{"$f":"AA27/AA26","v":1},{"$f":"IF(Input!$B$33=\"No\",\"\",AB27/AB26)","v":""},null,"90 mil",{"$f":"IF(MIN(Results!E7,Results!E13)=Results!E7,'Factor Results'!AE13,1)","v":1},{"$f":"IF(MIN(Results!F7,Results!F13)=Results!F7,'Factor Results'!AF13,1)","v":1},{"$f":"IF(MIN(Results!G7,Results!G13)=Results!G7,'Factor Results'!AG13,1)","v":1},{"$f":"IF(MIN(Results!H7,Results!H13)=Results!H7,'Factor Results'!AH13,1)","v":1},{"$f":"IF(MIN(Results!I7,Results!I13)=Results!I7,'Factor Results'!AI13,1)","v":1},{"$f":"IF(MIN(Results!J7,Results!J13)=Results!J7,'Factor Results'!AJ13,1)","v":{"$error":"#VALUE!"}},{"$f":"IF(MIN(Results!L7,Results!L13)=Results!L7,'Factor Results'!AU13,1)","v":1},{"$f":"IF(MIN(Results!M7,Results!M13)=Results!M7,'Factor Results'!AV13,1)","v":1},{"$f":"IF(MIN(Results!N7,Results!N13)=Results!N7,'Factor Results'!AW13,1)","v":1},{"$f":"IF(MIN(Results!O7,Results!O13)=Results!O7,'Factor Results'!AX13,1)","v":1},{"$f":"IF(MIN(Results!P7,Results!P13)=Results!P7,'Factor Results'!AY13,1)","v":1},{"$f":"IF(MIN(Results!Q7,Results!Q13)=Results!Q7,'Factor Results'!AZ13,1)","v":{"$error":"#VALUE!"}}]
[null,"Tape",{"$f":"Q29/Q28","v":1},{"$f":"R29/R28","v":1},{"$f":"S29/S28","v":1},{"$f":"T29/T28","v":1},{"$f":"U29/U28","v":1},{"$f":"IF(Input!$B$33=\"No\",\"\",V29/V28)","v":""},{"$f":"W29/W28","v":1},{"$f":"X29/X28","v":1},{"$f":"Y29/Y28","v":1},{"$f":"Z29/Z28","v":1},{"$f":"AA29/AA28","v":1},{"$f":"IF(Input!$B$33=\"No\",\"\",AB29/AB28)","v":""},null,"40 mil",{"$f":"IF(MIN(Results!E7,Results!E19)=Results!E7,1,'Factor Results'!AE55)","v":1},{"$f":"IF(MIN(Results!F7,Results!F19)=Results!F7,1,'Factor Results'!AF55)","v":1},{"$f":"IF(MIN(Results!G7,Results!G19)=Results!G7,1,'Factor Results'!AG55)","v":1},{"$f":"IF(MIN(Results!H7,Results!H19)=Results!H7,1,'Factor Results'!AH55)","v":1},{"$f":"IF(MIN(Results!I7,Results!I19)=Results!I7,1,'Factor Results'!AI55)","v":1},{"$f":"IF(MIN(Results!J7,Results!J19)=Results!J7,1,'Factor Results'!AJ55)","v":1},{"$f":"IF(MIN(Results!L7,Results!L19)=Results!L7,1,'Factor Results'!AU55)","v":1},{"$f":"IF(MIN(Results!M7,Results!M19)=Results!M7,1,'Factor Results'!AV55)","v":1},{"$f":"IF(MIN(Results!N7,Results!N19)=Results!N7,1,'Factor Results'!AW55)","v":1},{"$f":"IF(MIN(Results!O7,Results!O19)=Results!O7,1,'Factor Results'!AX55)","v":1},{"$f":"IF(MIN(Results!P7,Results!P19)=Results!P7,1,'Factor Results'!AY55)","v":1},{"$f":"IF(MIN(Results!Q7,Results!Q19)=Results!Q7,1,'Factor Results'!AZ55)","v":1}]
[null,"Inverted",{"$f":"Q31/Q30","v":1},{"$f":"R31/R30","v":1},{"$f":"S31/S30","v":1},{"$f":"T31/T30","v":1.5589918631002146},{"$f":"U31/U30","v":11.19418836617262},{"$f":"IF(Input!$B$33=\"No\",\"\",V31/V30)","v":""},{"$f":"W31/W30","v":1},{"$f":"X31/X30","v":1},{"$f":"Y31/Y30","v":1},{"$f":"Z31/Z30","v":1.2353456297027765},{"$f":"AA31/AA30","v":2.4388266962374989},{"$f":"IF(Input!$B$33=\"No\",\"\",AB31/AB30)","v":""},null,"Tape",{"$f":"IF(MIN(Results!E7,Results!E19)=Results!E7,'Factor Results'!AE19,1)","v":1},{"$f":"IF(MIN(Results!F7,Results!F19)=Results!F7,'Factor Results'!AF19,1)","v":1},{"$f":"IF(MIN(Results!G7,Results!G19)=Results!G7,'Factor Results'!AG19,1)","v":1},{"$f":"IF(MIN(Results!H7,Results!H19)=Results!H7,'Factor Results'!AH19,1)","v":1},{"$f":"IF(MIN(Results!I7,Results!I19)=Results!I7,'Factor Results'!AI19,1)","v":1},{"$f":"IF(MIN(Results!J7,Results!J19)=Results!J7,'Factor Results'!AJ19,1)","v":{"$error":"#VALUE!"}},{"$f":"IF(MIN(Results!L7,Results!L19)=Results!L7,'Factor Results'!AU19,1)","v":1},{"$f":"IF(MIN(Results!M7,Results!M19)=Results!M7,'Factor Results'!AV19,1)","v":1},{"$f":"IF(MIN(Results!N7,Results!N19)=Results!N7,'Factor Results'!AW19,1)","v":1},{"$f":"IF(MIN(Results!O7,Results!O19)=Results!O7,'Factor Results'!AX19,1)","v":1},{"$f":"IF(MIN(Results!P7,Results!P19)=Results!P7,'Factor Results'!AY19,1)","v":1},{"$f":"IF(MIN(Results!Q7,Results!Q19)=Results!Q7,'Factor Results'!AZ19,1)","v":{"$error":"#VALUE!"}}]
["90 mil","40 mil",{"$f":"Q26/Q27","v":1},{"$f":"R26/R27","v":1},{"$f":"S26/S27","v":1},{"$f":"T26/T27","v":1},{"$f":"U26/U27","v":1},{"$f":"IF(Input!$B$33=\"No\",\"\",V26/V27)","v":""},{"$f":"W26/W27","v":1},{"$f":"X26/X27","v":1},{"$f":"Y26/Y27","v":1},{"$f":"Z26/Z27","v":1},{"$f":"AA26/AA27","v":1},{"$f":"IF(Input!$B$33=\"No\",\"\",AB26/AB27)","v":""},null,"40 mil",{"$f":"IF(MIN(Results!E7,Results!E25)=Results!E7,1,'Factor Results'!AE79)","v":1},{"$f":"IF(MIN(Results!F7,Results!F25)=Results!F7,1,'Factor Results'!AF79)","v":1},{"$f":"IF(MIN(Results!G7,Results!G25)=Results!G7,1,'Factor Results'!AG79)","v":1},{"$f":"IF(MIN(Results!H7,Results!H25)=Results!H7,1,'Factor Results'!AH79)","v":0.64144016634660161},{"$f":"IF(MIN(Results!I7,Results!I25)=Results!I7,1,'Factor Results'!AI79)","v":8.9332068327693137E-2},{"$f":"IF(MIN(Results!J7,Results!J25)=Results!J7,1,'Factor Results'!AJ79)","v":1},{"$f":"IF(MIN(Results!L7,Results!L25)=Results!L7,1,'Factor Results'!AU79)","v":1},{"$f":"IF(MIN(Results!M7,Results!M25)=Results!M7,1,'Factor Results'!AV79)","v":1},{"$f":"IF(MIN(Results!N7,Results!N25)=Results!N7,1,'Factor Results'!AW79)","v":1},{"$f":"IF(MIN(Results!O7,Results!O25)=Results!O7,1,'Factor Results'!AX79)","v":0.80949005359787407},{"$f":"IF(MIN(Results!P7,Results!P25)=Results!P7,1,'Factor Results'!AY79)","v":0.41003323505632872},{"$f":"IF(MIN(Results!Q7,Results!Q25)=Results!Q7,1,'Factor Results'!AZ79)","v":1}]
[null,"90 mil",1,1,1,1,1,{"$f":"IF(Input!$B$33=\"No\",\"\",1)","v":""},1,1,1,1,1,{"$f":"IF(Input!$B$33=\"No\",\"\",1)","v":""},null,"Inverted",{"$f":"IF(MIN(Results!E7,Results!E25)=Results!E7,'Factor Results'!AE25,1)","v":1},{"$f":"IF(MIN(Results!F7,Results!F25)=Results!F7,'Factor Results'!AF25,1)","v":1},{"$f":"IF(MIN(Results!G7,Results!G25)=Results!G7,'Factor Results'!AG25,1)","v":1},{"$f":"IF(MIN(Results!H7,Results!H25)=Results!H7,'Factor Results'!AH25,1)","v":1},{"$f":"IF(MIN(Results!I7,Results!I25)=Results!I7,'Factor Results'!AI25,1)","v":1},{"$f":"IF(MIN(Results!J7,Results!J25)=Results!J7,'Factor Results'!AJ25,1)","v":{"$error":"#VALUE!"}},{"$f":"IF(MIN(Results!L7,Results!L25)=Results!L7,'Factor Results'!AU25,1)","v":1},{"$f":"IF(MIN(Results!M7,Results!M25)=Results!M7,'Factor Results'!AV25,1)","v":1},{"$f":"IF(MIN(Results!N7,Results!N25)=Results!N7,'Factor Results'!AW25,1)","v":1},{"$f":"IF(MIN(Results!O7,Results!O25)=Results!O7,'Factor Results'!AX25,1)","v":1},{"$f":"IF(MIN(Results!P7,Results!P25)=Results!P7,'Factor Results'!AY25,1)","v":1},{"$f":"IF(MIN(Results!Q7,Results!Q25)=Results!Q7,'Factor Results'!AZ25,1)","v":{"$error":"#VALUE!"}}]
[null,"Tape",{"$f":"Q33/Q32","v":1},{"$f":"R33/R32","v":1},{"$f":"S33/S32","v":1},{"$f":"T33/T32","v":1},{"$f":"U33/U32","v":1},{"$f":"IF(Input!$B$33=\"No\",\"\",V33/V32)","v":""},{"$f":"W33/W32","v":1},{"$f":"X33/X32","v":1},{"$f":"Y33/Y32","v":1},{"$f":"Z33/Z32","v":1},{"$f":"AA33/AA32","v":1},{"$f":"IF(Input!$B$33=\"No\",\"\",AB33/AB32)","v":""},null,"90 mil",{"$f":"IF(MIN(Results!E13,Results!E19)=Results!E13,1,'Factor Results'!AE61)","v":1},{"$f":"IF(MIN(Results!F13,Results!F19)=Results!F13,1,'Factor Results'!AF61)","v":1},{"$f":"IF(MIN(Results!G13,Results!G19)=Results!G13,1,'Factor Results'!AG61)","v":1},{"$f":"IF(MIN(Results!H13,Results!H19)=Results!H13,1,'Factor Results'!AH61)","v":1},{"$f":"IF(MIN(Results!I13,Results!I19)=Results!I13,1,'Factor Results'!AI61)","v":1},{"$f":"IF(MIN(Results!J13,Results!J19)=Results!J13,1,'Factor Results'!AJ61)","v":1},{"$f":"IF(MIN(Results!L13,Results!L19)=Results!L13,1,'Factor Results'!AU61)","v":1},{"$f":"IF(MIN(Results!M13,Results!M19)=Results!M13,1,'Factor Results'!AV61)","v":1},{"$f":"IF(MIN(Results!N13,Results!N19)=Results!N13,1,'Factor Results'!AW61)","v":1},{"$f":"IF(MIN(Results!O13,Results!O19)=Results!O13,1,'Factor Results'!AX61)","v":1},{"$f":"IF(MIN(Results!P13,Results!P19)=Results!P13,1,'Factor Results'!AY61)","v":1},{"$f":"IF(MIN(Results!Q13,Results!Q19)=Results!Q13,1,'Factor Results'!AZ61)","v":1}]
[null,"Inverted",{"$f":"Q35/Q34","v":1},{"$f":"R35/R34","v":1},{"$f":"S35/S34","v":1},{"$f":"T35/T34","v":1.5589918631002146},{"$f":"U35/U34","v":11.19418836617262},{"$f":"IF(Input!$B$33=\"No\",\"\",V35/V34)","v":""},{"$f":"W35/W34","v":1},{"$f":"X35/X34","v":1},{"$f":"Y35/Y34","v":1},{"$f":"Z35/Z34","v":1.2353456297027765},{"$f":"AA35/AA34","v":2.4388266962374989},{"$f":"IF(Input!$B$33=\"No\",\"\",AB35/AB34)","v":""},null,"Tape",{"$f":"IF(MIN(Results!E13,Results!E19)=Results!E13,'Factor Results'!AE43,1)","v":1},{"$f":"IF(MIN(Results!F13,Results!F19)=Results!F13,'Factor Results'!AF43,1)","v":1},{"$f":"IF(MIN(Results!G13,Results!G19)=Results!G13,'Factor Results'!AG43,1)","v":1},{"$f":"IF(MIN(Results!H13,Results!H19)=Results!H13,'Factor Results'!AH43,1)","v":1},{"$f":"IF(MIN(Results!I13,Results!I19)=Results!I13,'Factor Results'!AI43,1)","v":1},{"$f":"IF(MIN(Results!J13,Results!J19)=Results!J13,'Factor Results'!AJ43,1)","v":{"$error":"#VALUE!"}},{"$f":"IF(MIN(Results!L13,Results!L19)=Results!L13,'Factor Results'!AU43,1)","v":1},{"$f":"IF(MIN(Results!M13,Results!M19)=Results!M13,'Factor Results'!AV43,1)","v":1},{"$f":"IF(MIN(Results!N13,Results!N19)=Results!N13,'Factor Results'!AW43,1)","v":1},{"$f":"IF(MIN(Results!O13,Results!O19)=Results!O13,'Factor Results'!AX43,1)","v":1},{"$f":"IF(MIN(Results!P13,Results!P19)=Results!P13,'Factor Results'!AY43,1)","v":1},{"$f":"IF(MIN(Results!Q13,Results!Q19)=Results!Q13,'Factor Results'!AZ43,1)","v":{"$error":"#VALUE!"}}]
["Tape","40 mil",{"$f":"Q28/Q29","v":1},{"$f":"R28/R29","v":1},{"$f":"S28/S29","v":1},{"$f":"T28/T29","v":1},{"$f":"U28/U29","v":1},{"$f":"IF(Input!$B$33=\"No\",\"\",V28/V29)","v":""},{"$f":"W28/W29","v":1},{"$f":"X28/X29","v":1},{"$f":"Y28/Y29","v":1},{"$f":"Z28/Z29","v":1},{"$f":"AA28/AA29","v":1},{"$f":"IF(Input!$B$33=\"No\",\"\",AB28/AB29)","v":""},null,"90 mil",{"$f":"IF(MIN(Results!E13,Results!E25)=Results!E13,1,'Factor Results'!AE85)","v":1},{"$f":"IF(MIN(Results!F13,Results!F25)=Results!F13,1,'Factor Results'!AF85)","v":1},{"$f":"IF(MIN(Results!G13,Results!G25)=Results!G13,1,'Factor Results'!AG85)","v":1},{"$f":"IF(MIN(Results!H13,Results!H25)=Results!H13,1,'Factor Results'!AH85)","v":0.64144016634660161},{"$f":"IF(MIN(Results!I13,Results!I25)=Results!I13,1,'Factor Results'!AI85)","v":8.9332068327693137E-2},{"$f":"IF(MIN(Results!J13,Results!J25)=Results!J13,1,'Factor Results'!AJ85)","v":1},{"$f":"IF(MIN(Results!L13,Results!L25)=Results!L13,1,'Factor Results'!AU85)","v":1},{"$f":"IF(MIN(Results!M13,Results!M25)=Results!M13,1,'Factor Results'!AV85)","v":1},{"$f":"IF(MIN(Results!N13,Results!N25)=Results!N13,1,'Factor Results'!AW85)","v":1},{"$f":"IF(MIN(Results!O13,Results!O25)=Results!O13,1,'Factor Results'!AX85)","v":0.80949005359787407},{"$f":"IF(MIN(Results!P13,Results!P25)=Results!P13,1,'Factor Results'!AY85)","v":0.41003323505632872},{"$f":"IF(MIN(Results!Q13,Results!Q25)=Results!Q13,1,'Factor Results'!AZ85)","v":1}]
[null,"90 mil",{"$f":"Q32/Q33","v":1},{"$f":"R32/R33","v":1},{"$f":"S32/S33","v":1},{"$f":"T32/T33","v":1},{"$f":"U32/U33","v":1},{"$f":"IF(Input!$B$33=\"No\",\"\",V32/V33)","v":""},{"$f":"W32/W33","v":1},{"$f":"X32/X33","v":1},{"$f":"Y32/Y33","v":1},{"$f":"Z32/Z33","v":1},{"$f":"AA32/AA33","v":1},{"$f":"IF(Input!$B$33=\"No\",\"\",AB32/AB33)","v":""},null,"Inverted",{"$f":"IF(MIN(Results!E13,Results!E25)=Results!E13,'Factor Results'!AE49,1)","v":1},{"$f":"IF(MIN(Results!F13,Results!F25)=Results!F13,'Factor Results'!AF49,1)","v":1},{"$f":"IF(MIN(Results!G13,Results!G25)=Results!G13,'Factor Results'!AG49,1)","v":1},{"$f":"IF(MIN(Results!H13,Results!H25)=Results!H13,'Factor Results'!AH49,1)","v":1},{"$f":"IF(MIN(Results!I13,Results!I25)=Results!I13,'Factor Results'!AI49,1)","v":1},{"$f":"IF(MIN(Results!J13,Results!J25)=Results!J13,'Factor Results'!AJ49,1)","v":{"$error":"#VALUE!"}},{"$f":"IF(MIN(Results!L13,Results!L25)=Results!L13,'Factor Results'!AU49,1)","v":1},{"$f":"IF(MIN(Results!M13,Results!M25)=Results!M13,'Factor Results'!AV49,1)","v":1},{"$f":"IF(MIN(Results!N13,Results!N25)=Results!N13,'Factor Results'!AW49,1)","v":1},{"$f":"IF(MIN(Results!O13,Results!O25)=Results!O13,'Factor Results'!AX49,1)","v":1},{"$f":"IF(MIN(Results!P13,Results!P25)=Results!P13,'Factor Results'!AY49,1)","v":1},{"$f":"IF(MIN(Results!Q13,Results!Q25)=Results!Q13,'Factor Results'!AZ49,1)","v":{"$error":"#VALUE!"}}]
[null,"Tape",1,1,1,1,1,{"$f":"IF(Input!$B$33=\"No\",\"\",1)","v":""},1,1,1,1,1,{"$f":"IF(Input!$B$33=\"No\",\"\",1)","v":""},null,"Tape",{"$f":"IF(MIN(Results!E19,Results!E25)=Results!E19,1,'Factor Results'!AE91)","v":1},{"$f":"IF(MIN(Results!F19,Results!F25)=Results!F19,1,'Factor Results'!AF91)","v":1},{"$f":"IF(MIN(Results!G19,Results!G25)=Results!G19,1,'Factor Results'!AG91)","v":1},{"$f":"IF(MIN(Results!H19,Results!H25)=Results!H19,1,'Factor Results'!AH91)","v":0.64144016634660161},{"$f":"IF(MIN(Results!I19,Results!I25)=Results!I19,1,'Factor Results'!AI91)","v":8.9332068327693137E-2},{"$f":"IF(MIN(Results!J19,Results!J25)=Results!J19,1,'Factor Results'!AJ91)","v":1},{"$f":"IF(MIN(Results!L19,Results!L25)=Results!L19,1,'Factor Results'!AU91)","v":1},{"$f":"IF(MIN(Results!M19,Results!M25)=Results!M19,1,'Factor Results'!AV91)","v":1},{"$f":"IF(MIN(Results!N19,Results!N25)=Results!N19,1,'Factor Results'!AW91)","v":1},{"$f":"IF(MIN(Results!O19,Results!O25)=Results!O19,1,'Factor Results'!AX91)","v":1},{"$f":"IF(MIN(Results!P19,Results!P25)=Results!P19,1,'Factor Results'!AY91)","v":0.41003323505632872},{"$f":"IF(MIN(Results!Q19,Results!Q25)=Results!Q19,1,'Factor Results'!AZ91)","v":1}]
[null,"Inverted",{"$f":"Q37/Q36","v":1},{"$f":"R37/R36","v":1},{"$f":"S37/S36","v":1},{"$f":"T37/T36","v":1.5589918631002146},{"$f":"U37/U36","v":11.19418836617262},{"$f":"IF(Input!$B$33=\"No\",\"\",V37/V36)","v":""},{"$f":"W37/W36","v":1},{"$f":"X37/X36","v":1},{"$f":"Y37/Y36","v":1},{"$f":"Z37/Z36","v":1.2353040911345419},{"$f":"AA37/AA36","v":2.4388266962374989},{"$f":"IF(Input!$B$33=\"No\",\"\",AB37/AB36)","v":""},null,"Inverted",{"$f":"IF(MIN(Results!E19,Results!E25)=Results!E19,'Factor Results'!AE73,1)","v":1},{"$f":"IF(MIN(Results!F19,Results!F25)=Results!F19,'Factor Results'!AF73,1)","v":1},{"$f":"IF(MIN(Results!G19,Results!G25)=Results!G19,'Factor Results'!AG73,1)","v":1},{"$f":"IF(MIN(Results!H19,Results!H25)=Results!H19,'Factor Results'!AH73,1)","v":1},{"$f":"IF(MIN(Results!I19,Results!I25)=Results!I19,'Factor Results'!AI73,1)","v":1},{"$f":"IF(MIN(Results!J19,Results!J25)=Results!J19,'Factor Results'!AJ73,1)","v":{"$error":"#VALUE!"}},{"$f":"IF(MIN(Results!L19,Results!L25)=Results!L19,'Factor Results'!AU73,1)","v":1},{"$f":"IF(MIN(Results!M19,Results!M25)=Results!M19,'Factor Results'!AV73,1)","v":1},{"$f":"IF(MIN(Results!N19,Results!N25)=Results!N19,'Factor Results'!AW73,1)","v":1},{"$f":"IF(MIN(Results!O19,Results!O25)=Results!O19,'Factor Results'!AX73,1)","v":1.2353040911345419},{"$f":"IF(MIN(Results!P19,Results!P25)=Results!P19,'Factor Results'!AY73,1)","v":1},{"$f":"IF(MIN(Results!Q19,Results!Q25)=Results!Q19,'Factor Results'!AZ73,1)","v":{"$error":"#VALUE!"}}]
["Inverted","40 mil",{"$f":"Q30/Q31","v":1},{"$f":"R30/R31","v":1},{"$f":"S30/S31","v":1},{"$f":"T30/T31","v":0.64144016634660161},{"$f":"U30/U31","v":8.9332068327693137E-2},{"$f":"IF(Input!$B$33=\"No\",\"\",V30/V31)","v":""},{"$f":"W30/W31","v":1},{"$f":"X30/X31","v":1},{"$f":"Y30/Y31","v":1},{"$f":"Z30/Z31","v":0.80949005359787407},{"$f":"AA30/AA31","v":0.41003323505632872},{"$f":"IF(Input!$B$33=\"No\",\"\",AB30/AB31)","v":""}]
[null,"90 mil",{"$f":"Q34/Q35","v":1},{"$f":"R34/R35","v":1},{"$f":"S34/S35","v":1},{"$f":"T34/T35","v":0.64144016634660161},{"$f":"U34/U35","v":8.9332068327693137E-2},{"$f":"IF(Input!$B$33=\"No\",\"\",V34/V35)","v":""},{"$f":"W34/W35","v":1},{"$f":"X34/X35","v":1},{"$f":"Y34/Y35","v":1},{"$f":"Z34/Z35","v":0.80949005359787407},{"$f":"AA34/AA35","v":0.41003323505632872},{"$f":"IF(Input!$B$33=\"No\",\"\",AB34/AB35)","v":""}]
[null,"Tape",{"$f":"Q36/Q37","v":1},{"$f":"R36/R37","v":1},{"$f":"S36/S37","v":1},{"$f":"T36/T37","v":0.64144016634660161},{"$f":"U36/U37","v":8.9332068327693137E-2},{"$f":"IF(Input!$B$33=\"No\",\"\",V36/V37)","v":""},{"$f":"W36/W37","v":1},{"$f":"X36/X37","v":1},{"$f":"Y36/Y37","v":1},{"$f":"Z36/Z37","v":0.80951727366301263},{"$f":"AA36/AA37","v":0.41003323505632872},{"$f":"IF(Input!$B$33=\"No\",\"\",AB36/AB37)","v":""}]
[null,"Inverted",1,1,1,1,1,{"$f":"IF(Input!$B$33=\"No\",\"\",1)","v":""},1,1,1,1,1,{"$f":"IF(Input!$B$33=\"No\",\"\",1)","v":""}]
[]
["Bidding Factors for Restripe-PCC: White Edge Line",null,null,null,null,null,null,null,null,null,null,null,null,null,null,"Bidding Factors for Restripe-PCC: White Lane Line"]
["Reference Material","Material","Off-Peak Application",null,null,null,null,null,"Night Time Application",null,null,null,null,null,null,"Material","Off-Peak Application",null,null,null,null,null,"Night Time Application"]
[null,null,"ADT per Lane",null,null,null,null,"User ADT","ADT per Lane",null,null,null,null,"User ADT",null,null,"ADT per Lane",null,null,null,null,"User ADT","ADT per Lane",null,null,null,null,"User ADT"]
[null,null,5000,10000,15000,20000,25000,{"$f":"IF(Input!$B$33=\"No\",\"\",Input!$B$33)","v":""},5000,10000,15000,20000,25000,{"$f":"IF(Input!$B$33=\"No\",\"\",Input!$B$33)","v":""},null,null,5000,10000,15000,20000,25000,null,5000,10000,15000,20000,25000,{"$f":"IF(Input!$B$33=\"No\",\"\",Input!$B$33)","v":""}]
["40 mil","40 mil",1,1,1,1,1,{"$f":"IF(Input!$B$33=\"No\",\"\",1)","v":""},1,1,1,1,1,{"$f":"IF(Input!$B$33=\"No\",\"\",1)","v":""},null,"40 mil",{"$f":"IF(MIN(Results!E8,Results!E14)=Results!E8,1,'Factor Results'!AE32)","v":1},{"$f":"IF(MIN(Results!F8,Results!F14)=Results!F8,1,'Factor Results'!AF32)","v":1},{"$f":"IF(MIN(Results!G8,Results!G14)=Results!G8,1,'Factor Results'!AG32)","v":1},{"$f":"IF(MIN(Results!H8,Results!H14)=Results!H8,1,'Factor Results'!AH32)","v":1},{"$f":"IF(MIN(Results!I8,Results!I14)=Results!I8,1,'Factor Results'!AI32)","v":1},{"$f":"IF(MIN(Results!J8,Results!J14)=Results!J8,1,'Factor Results'!AJ32)","v":1},{"$f":"IF(MIN(Results!L8,Results!L14)=Results!L8,1,'Factor Results'!AU32)","v":1},{"$f":"IF(MIN(Results!M8,Results!M14)=Results!M8,1,'Factor Results'!AV32)","v":1},{"$f":"IF(MIN(Results!N8,Results!N14)=Results!N8,1,'Factor Results'!AW32)","v":1},{"$f":"IF(MIN(Results!O8,Results!O14)=Results!O8,1,'Factor Results'!AX32)","v":1},{"$f":"IF(MIN(Results!P8,Results!P14)=Results!P8,1,'Factor Results'!AY32)","v":1},{"$f":"IF(MIN(Results!Q8,Results!Q14)=Results!Q8,1,'Factor Results'!AZ32)","v":1}]
[null,"90 mil",{"$f":"Q48/Q47","v":1},{"$f":"R48/R47","v":1},{"$f":"S48/S47","v":1},{"$f":"T48/T47","v":1},{"$f":"U48/U47","v":1},{"$f":"IF(Input!$B$33=\"No\",\"\",V48/V47)","v":""},{"$f":"W48/W47","v":1},{"$f":"X48/X47","v":1},{"$f":"Y48/Y47","v":1},{"$f":"Z48/Z47","v":1},{"$f":"AA48/AA47","v":1},{"$f":"IF(Input!$B$33=\"No\",\"\",AB48/AB47)","v":""},null,"90 mil",{"$f":"IF(MIN(Results!E8,Results!E14)=Results!E8,'Factor Results'!AE14,1)","v":1},{"$f":"IF(MIN(Results!F8,Results!F14)=Results!F8,'Factor Results'!AF14,1)","v":1},{"$f":"IF(MIN(Results!G8,Results!G14)=Results!G8,'Factor Results'!AG14,1)","v":1},{"$f":"IF(MIN(Results!H8,Results!H14)=Results!H8,'Factor Results'!AH14,1)","v":1},{"$f":"IF(MIN(Results!I8,Results!I14)=Results!I8,'Factor Results'!AI14,1)","v":1},{"$f":"IF(MIN(Results!J8,Results!J14)=Results!J8,'Factor Results'!AJ14,1)","v":{"$error":"#VALUE!"}},{"$f":"IF(MIN(Results!L8,Results!L14)=Results!L8,'Factor Results'!AU14,1)","v":1},{"$f":"IF(MIN(Results!M8,Results!M14)=Results!M8,'Factor Results'!AV14,1)","v":1},{"$f":"IF(MIN(Results!N8,Results!N14)=Results!N8,'Factor Results'!AW14,1)","v":1},{"$f":"IF(MIN(Results!O8,Results!O14)=Results!O8,'Factor Results'!AX14,1)","v":1},{"$f":"IF(MIN(Results!P8,Results!P14)=Results!P8,'Factor Results'!AY14,1)","v":1},{"$f":"IF(MIN(Results!Q8,Results!Q14)=Results!Q8,'Factor Results'!AZ14,1)","v":{"$error":"#VALUE!"}}]
[null,"Tape",{"$f":"Q50/Q49","v":1},{"$f":"R50/R49","v":1},{"$f":"S50/S49","v":1},{"$f":"T50/T49","v":1},{"$f":"U50/U49","v":1},{"$f":"IF(Input!$B$33=\"No\",\"\",V50/V49)","v":""},{"$f":"W50/W49","v":1},{"$f":"X50/X49","v":1},{"$f":"Y50/Y49","v":1},{"$f":"Z50/Z49","v":1},{"$f":"AA50/AA49","v":1},{"$f":"IF(Input!$B$33=\"No\",\"\",AB50/AB49)","v":""},null,"40 mil",{"$f":"IF(MIN(Results!E8,Results!E20)=Results!E8,1,'Factor Results'!AE56)","v":1},{"$f":"IF(MIN(Results!F8,Results!F20)=Results!F8,1,'Factor Results'!AF56)","v":1},{"$f":"IF(MIN(Results!G8,Results!G20)=Results!G8,1,'Factor Results'!AG56)","v":1},{"$f":"IF(MIN(Results!H8,Results!H20)=Results!H8,1,'Factor Results'!AH56)","v":1},{"$f":"IF(MIN(Results!I8,Results!I20)=Results!I8,1,'Factor Results'!AI56)","v":1},{"$f":"IF(MIN(Results!J8,Results!J20)=Results!J8,1,'Factor Results'!AJ56)","v":1},{"$f":"IF(MIN(Results!L8,Results!L20)=Results!L8,1,'Factor Results'!AU56)","v":1},{"$f":"IF(MIN(Results!M8,Results!M20)=Results!M8,1,'Factor Results'!AV56)","v":1},{"$f":"IF(MIN(Results!N8,Results!N20)=Results!N8,1,'Factor Results'!AW56)","v":1},{"$f":"IF(MIN(Results!O8,Results!O20)=Results!O8,1,'Factor Results'!AX56)","v":1},{"$f":"IF(MIN(Results!P8,Results!P20)=Results!P8,1,'Factor Results'!AY56)","v":1},{"$f":"IF(MIN(Results!Q8,Results!Q20)=Results!Q8,1,'Factor Results'!AZ56)","v":1}]
[null,"Inverted",{"$f":"Q52/Q51","v":1},{"$f":"R52/R51","v":1},{"$f":"S52/S51","v":1},{"$f":"T52/T51","v":1.6749316429074772},{"$f":"U52/U51","v":14.339195108351021},{"$f":"IF(Input!$B$33=\"No\",\"\",V52/V51)","v":""},{"$f":"W52/W51","v":1},{"$f":"X52/X51","v":1},{"$f":"Y52/Y51","v":1},{"$f":"Z52/Z51","v":1.2358912334502177},{"$f":"AA52/AA51","v":2.4621603220560568},{"$f":"IF(Input!$B$33=\"No\",\"\",AB52/AB51)","v":""},null,"Tape",{"$f":"IF(MIN(Results!E8,Results!E20)=Results!E8,'Factor Results'!AE20,1)","v":1},{"$f":"IF(MIN(Results!F8,Results!F20)=Results!F8,'Factor Results'!AF20,1)","v":1},{"$f":"IF(MIN(Results!G8,Results!G20)=Results!G8,'Factor Results'!AG20,1)","v":1},{"$f":"IF(MIN(Results!H8,Results!H20)=Results!H8,'Factor Results'!AH20,1)","v":1},{"$f":"IF(MIN(Results!I8,Results!I20)=Results!I8,'Factor Results'!AI20,1)","v":1},{"$f":"IF(MIN(Results!J8,Results!J20)=Results!J8,'Factor Results'!AJ20,1)","v":{"$error":"#VALUE!"}},{"$f":"IF(MIN(Results!L8,Results!L20)=Results!L8,'Factor Results'!AU20,1)","v":1},{"$f":"IF(MIN(Results!M8,Results!M20)=Results!M8,'Factor Results'!AV20,1)","v":1},{"$f":"IF(MIN(Results!N8,Results!N20)=Results!N8,'Factor Results'!AW20,1)","v":1},{"$f":"IF(MIN(Results!O8,Results!O20)=Results!O8,'Factor Results'!AX20,1)","v":1},{"$f":"IF(MIN(Results!P8,Results!P20)=Results!P8,'Factor Results'!AY20,1)","v":1},{"$f":"IF(MIN(Results!Q8,Results!Q20)=Results!Q8,'Factor Results'!AZ20,1)","v":{"$error":"#VALUE!"}}]
["90 mil","40 mil",{"$f":"Q47/Q48","v":1},{"$f":"R47/R48","v":1},{"$f":"S47/S48","v":1},{"$f":"T47/T48","v":1},{"$f":"U47/U48","v":1},{"$f":"IF(Input!$B$33=\"No\",\"\",V47/V48)","v":""},{"$f":"W47/W48","v":1},{"$f":"X47/X48","v":1},{"$f":"Y47/Y48","v":1},{"$f":"Z47/Z48","v":1},{"$f":"AA47/AA48","v":1},{"$f":"IF(Input!$B$33=\"No\",\"\",AB47/AB48)","v":""},null,"40 mil",{"$f":"IF(MIN(Results!E8,Results!E26)=Results!E8,1,'Factor Results'!AE80)","v":1},{"$f":"IF(MIN(Results!F8,Results!F26)=Results!F8,1,'Factor Results'!AF80)","v":1},{"$f":"IF(MIN(Results!G8,Results!G26)=Results!G8,1,'Factor Results'!AG80)","v":1},{"$f":"IF(MIN(Results!H8,Results!H26)=Results!H8,1,'Factor Results'!AH80)","v":0.59703929066867578},{"$f":"IF(MIN(Results!I8,Results!I26)=Results!I8,1,'Factor Results'!AI80)","v":6.973892135811785E-2},{"$f":"IF(MIN(Results!J8,Results!J26)=Results!J8,1,'Factor Results'!AJ80)","v":1},{"$f":"IF(MIN(Results!L8,Results!L26)=Results!L8,1,'Factor Results'!AU80)","v":1},{"$f":"IF(MIN(Results!M8,Results!M26)=Results!M8,1,'Factor Results'!AV80)","v":1},{"$f":"IF(MIN(Results!N8,Results!N26)=Results!N8,1,'Factor Results'!AW80)","v":1},{"$f":"IF(MIN(Results!O8,Results!O26)=Results!O8,1,'Factor Results'!AX80)","v":0.80913269140061472},{"$f":"IF(MIN(Results!P8,Results!P26)=Results!P8,1,'Factor Results'!AY80)","v":0.40614739464444699},{"$f":"IF(MIN(Results!Q8,Results!Q26)=Results!Q8,1,'Factor Results'!AZ80)","v":1}]
[null,"90 mil",1,1,1,1,1,{"$f":"IF(Input!$B$33=\"No\",\"\",1)","v":""},1,1,1,1,1,{"$f":"IF(Input!$B$33=\"No\",\"\",1)","v":""},null,"Inverted",{"$f":"IF(MIN(Results!E8,Results!E26)=Results!E8,'Factor Results'!AE26,1)","v":1},{"$f":"IF(MIN(Results!F8,Results!F26)=Results!F8,'Factor Results'!AF26,1)","v":1},{"$f":"IF(MIN(Results!G8,Results!G26)=Results!G8,'Factor Results'!AG26,1)","v":1},{"$f":"IF(MIN(Results!H8,Results!H26)=Results!H8,'Factor Results'!AH26,1)","v":1},{"$f":"IF(MIN(Results!I8,Results!I26)=Results!I8,'Factor Results'!AI26,1)","v":1},{"$f":"IF(MIN(Results!J8,Results!J26)=Results!J8,'Factor Results'!AJ26,1)","v":{"$error":"#VALUE!"}},{"$f":"IF(MIN(Results!L8,Results!L26)=Results!L8,'Factor Results'!AU26,1)","v":1},{"$f":"IF(MIN(Results!M8,Results!M26)=Results!M8,'Factor Results'!AV26,1)","v":1},{"$f":"IF(MIN(Results!N8,Results!N26)=Results!N8,'Factor Results'!AW26,1)","v":1},{"$f":"IF(MIN(Results!O8,Results!O26)=Results!O8,'Factor Results'!AX26,1)","v":1},{"$f":"IF(MIN(Results!P8,Results!P26)=Results!P8,'Factor Results'!AY26,1)","v":1},{"$f":"IF(MIN(Results!Q8,Results!Q26)=Results!Q8,'Factor Results'!AZ26,1)","v":{"$error":"#VALUE!"}}]
[null,"Tape",{"$f":"Q54/Q53","v":1},{"$f":"R54/R53","v":1},{"$f":"S54/S53","v":1},{"$f":"T54/T53","v":1},{"$f":"U54/U53","v":1},{"$f":"IF(Input!$B$33=\"No\",\"\",V54/V53)","v":""},{"$f":"W54/W53","v":1},{"$f":"X54/X53","v":1},{"$f":"Y54/Y53","v":1},{"$f":"Z54/Z53","v":1},{"$f":"AA54/AA53","v":1},{"$f":"IF(Input!$B$33=\"No\",\"\",AB54/AB53)","v":""},null,"90 mil",{"$f":"IF(MIN(Results!E14,Results!E20)=Results!E14,1,'Factor Results'!AE62)","v":1},{"$f":"IF(MIN(Results!F14,Results!F20)=Results!F14,1,'Factor Results'!AF62)","v":1},{"$f":"IF(MIN(Results!G14,Results!G20)=Results!G14,1,'Factor Results'!AG62)","v":1},{"$f":"IF(MIN(Results!H14,Results!H20)=Results!H14,1,'Factor Results'!AH62)","v":1},{"$f":"IF(MIN(Results!I14,Results!I20)=Results!I14,1,'Factor Results'!AI62)","v":1},{"$f":"IF(MIN(Results!J14,Results!J20)=Results!J14,1,'Factor Results'!AJ62)","v":1},{"$f":"IF(MIN(Results!L14,Results!L20)=Results!L14,1,'Factor Results'!AU62)","v":1},{"$f":"IF(MIN(Results!M14,Results!M20)=Results!M14,1,'Factor Results'!AV62)","v":1},{"$f":"IF(MIN(Results!N14,Results!N20)=Results!N14,1,'Factor Results'!AW62)","v":1},{"$f":"IF(MIN(Results!O14,Results!O20)=Results!O14,1,'Factor Results'!AX62)","v":1},{"$f":"IF(MIN(Results!P14,Results!P20)=Results!P14,1,'Factor Results'!AY62)","v":1},{"$f":"IF(MIN(Results!Q14,Results!Q20)=Results!Q14,1,'Factor Results'!AZ62)","v":1}]
[null,"Inverted",{"$f":"Q56/Q55","v":1},{"$f":"R56/R55","v":1},{"$f":"S56/S55","v":1},{"$f":"T56/T55","v":1.6749316429074772},{"$f":"U56/U55","v":14.339195108351021},{"$f":"IF(Input!$B$33=\"No\",\"\",V56/V55)","v":""},{"$f":"W56/W55","v":1},{"$f":"X56/X55","v":1},{"$f":"Y56/Y55","v":1},{"$f":"Z56/Z55","v":1.2358912334502177},{"$f":"AA56/AA55","v":2.4621603220560568},{"$f":"IF(Input!$B$33=\"No\",\"\",AB56/AB55)","v":""},null,"Tape",{"$f":"IF(MIN(Results!E14,Results!E20)=Results!E14,'Factor Results'!AE44,1)","v":1},{"$f":"IF(MIN(Results!F14,Results!F20)=Results!F14,'Factor Results'!AF44,1)","v":1},{"$f":"IF(MIN(Results!G14,Results!G20)=Results!G14,'Factor Results'!AG44,1)","v":1},{"$f":"IF(MIN(Results!H14,Results!H20)=Results!H14,'Factor Results'!AH44,1)","v":1},{"$f":"IF(MIN(Results!I14,Results!I20)=Results!I14,'Factor Results'!AI44,1)","v":1},{"$f":"IF(MIN(Results!J14,Results!J20)=Results!J14,'Factor Results'!AJ44,1)","v":{"$error":"#VALUE!"}},{"$f":"IF(MIN(Results!L14,Results!L20)=Results!L14,'Factor Results'!AU44,1)","v":1},{"$f":"IF(MIN(Results!M14,Results!M20)=Results!M14,'Factor Results'!AV44,1)","v":1},{"$f":"IF(MIN(Results!N14,Results!N20)=Results!N14,'Factor Results'!AW44,1)","v":1},{"$f":"IF(MIN(Results!O14,Results!O20)=Results!O14,'Factor Results'!AX44,1)","v":1},{"$f":"IF(MIN(Results!P14,Results!P20)=Results!P14,'Factor Results'!AY44,1)","v":1},{"$f":"IF(MIN(Results!Q14,Results!Q20)=Results!Q14,'Factor Results'!AZ44,1)","v":{"$error":"#VALUE!"}}]
["Tape","40 mil",{"$f":"Q49/Q50","v":1},{"$f":"R49/R50","v":1},{"$f":"S49/S50","v":1},{"$f":"T49/T50","v":1},{"$f":"U49/U50","v":1},{"$f":"IF(Input!$B$33=\"No\",\"\",V49/V50)","v":""},{"$f":"W49/W50","v":1},{"$f":"X49/X50","v":1},{"$f":"Y49/Y50","v":1},{"$f":"Z49/Z50","v":1},{"$f":"AA49/AA50","v":1},{"$f":"IF(Input!$B$33=\"No\",\"\",AB49/AB50)","v":""},null,"90 mil",{"$f":"IF(MIN(Results!E14,Results!E26)=Results!E14,1,'Factor Results'!AE86)","v":1},{"$f":"IF(MIN(Results!F14,Results!F26)=Results!F14,1,'Factor Results'!AF86)","v":1},{"$f":"IF(MIN(Results!G14,Results!G26)=Results!G14,1,'Factor Results'!AG86)","v":1},{"$f":"IF(MIN(Results!H14,Results!H26)=Results!H14,1,'Factor Results'!AH86)","v":0.59703929066867578},{"$f":"IF(MIN(Results!I14,Results!I26)=Results!I14,1,'Factor Results'!AI86)","v":6.973892135811785E-2},{"$f":"IF(MIN(Results!J14,Results!J26)=Results!J14,1,'Factor Results'!AJ86)","v":1},{"$f":"IF(MIN(Results!L14,Results!L26)=Results!L14,1,'Factor Results'!AU86)","v":1},{"$f":"IF(MIN(Results!M14,Results!M26)=Results!M14,1,'Factor Results'!AV86)","v":1},{"$f":"IF(MIN(Results!N14,Results!N26)=Results!N14,1,'Factor Results'!AW86)","v":1},{"$f":"IF(MIN(Results!O14,Results!O26)=Results!O14,1,'Factor Results'!AX86)","v":0.80913269140061472},{"$f":"IF(MIN(Results!P14,Results!P26)=Results!P14,1,'Factor Results'!AY86)","v":0.40614739464444699},{"$f":"IF(MIN(Results!Q14,Results!Q26)=Results!Q14,1,'Factor Results'!AZ86)","v":1}]
[null,"90 mil",{"$f":"Q53/Q54","v":1},{"$f":"R53/R54","v":1},{"$f":"S53/S54","v":1},{"$f":"T53/T54","v":1},{"$f":"U53/U54","v":1},{"$f":"IF(Input!$B$33=\"No\",\"\",V53/V54)","v":""},{"$f":"W53/W54","v":1},{"$f":"X53/X54","v":1},{"$f":"Y53/Y54","v":1},{"$f":"Z53/Z54","v":1},{"$f":"AA53/AA54","v":1},{"$f":"IF(Input!$B$33=\"No\",\"\",AB53/AB54)","v":""},null,"Inverted",{"$f":"IF(MIN(Results!E14,Results!E26)=Results!E14,'Factor Results'!AE50,1)","v":1},{"$f":"IF(MIN(Results!F14,Results!F26)=Results!F14,'Factor Results'!AF50,1)","v":1},{"$f":"IF(MIN(Results!G14,Results!G26)=Results!G14,'Factor Results'!AG50,1)","v":1},{"$f":"IF(MIN(Results!H14,Results!H26)=Results!H14,'Factor Results'!AH50,1)","v":1},{"$f":"IF(MIN(Results!I14,Results!I26)=Results!I14,'Factor Results'!AI50,1)","v":1},{"$f":"IF(MIN(Results!J14,Results!J26)=Results!J14,'Factor Results'!AJ50,1)","v":{"$error":"#VALUE!"}},{"$f":"IF(MIN(Results!L14,Results!L26)=Results!L14,'Factor Results'!AU50,1)","v":1},{"$f":"IF(MIN(Results!M14,Results!M26)=Results!M14,'Factor Results'!AV50,1)","v":1},{"$f":"IF(MIN(Results!N14,Results!N26)=Results!N14,'Factor Results'!AW50,1)","v":1},{"$f":"IF(MIN(Results!O14,Results!O26)=Results!O14,'Factor Results'!AX50,1)","v":1},{"$f":"IF(MIN(Results!P14,Results!P26)=Results!P14,'Factor Results'!AY50,1)","v":1},{"$f":"IF(MIN(Results!Q14,Results!Q26)=Results!Q14,'Factor Results'!AZ50,1)","v":{"$error":"#VALUE!"}}]
[null,"Tape",1,1,1,1,1,{"$f":"IF(Input!$B$33=\"No\",\"\",1)","v":""},1,1,1,1,1,{"$f":"IF(Input!$B$33=\"No\",\"\",1)","v":""},null,"Tape",{"$f":"IF(MIN(Results!E20,Results!E26)=Results!E20,1,'Factor Results'!AE92)","v":1},{"$f":"IF(MIN(Results!F20,Results!F26)=Results!F20,1,'Factor Results'!AF92)","v":1},{"$f":"IF(MIN(Results!G20,Results!G26)=Results!G20,1,'Factor Results'!AG92)","v":1},{"$f":"IF(MIN(Results!H20,Results!H26)=Results!H20,1,'Factor Results'!AH92)","v":0.59703929066867578},{"$f":"IF(MIN(Results!I20,Results!I26)=Results!I20,1,'Factor Results'!AI92)","v":6.973892135811785E-2},{"$f":"IF(MIN(Results!J20,Results!J26)=Results!J20,1,'Factor Results'!AJ92)","v":1},{"$f":"IF(MIN(Results!L20,Results!L26)=Results!L20,1,'Factor Results'!AU92)","v":1},{"$f":"IF(MIN(Results!M20,Results!M26)=Results!M20,1,'Factor Results'!AV92)","v":1},{"$f":"IF(MIN(Results!N20,Results!N26)=Results!N20,1,'Factor Results'!AW92)","v":1},{"$f":"IF(MIN(Results!O20,Results!O26)=Results!O20,1,'Factor Results'!AX92)","v":0.80913269140061472},{"$f":"IF(MIN(Results!P20,Results!P26)=Results!P20,1,'Factor Results'!AY92)","v":0.40614739464444699},{"$f":"IF(MIN(Results!Q20,Results!Q26)=Results!Q20,1,'Factor Results'!AZ92)","v":1}]
[null,"Inverted",{"$f":"Q58/Q57","v":1},{"$f":"R58/R57","v":1},{"$f":"S58/S57","v":1},{"$f":"T58/T57","v":1.6749316429074772},{"$f":"U58/U57","v":14.339195108351021},{"$f":"IF(Input!$B$33=\"No\",\"\",V58/V57)","v":""},{"$f":"W58/W57","v":1},{"$f":"X58/X57","v":1},{"$f":"Y58/Y57","v":1},{"$f":"Z58/Z57","v":1.2358912334502177},{"$f":"AA58/AA57","v":2.4621603220560568},{"$f":"IF(Input!$B$33=\"No\",\"\",AB58/AB57)","v":""},null,"Inverted",{"$f":"IF(MIN(Results!E20,Results!E26)=Results!E20,'Factor Results'!AE74,1)","v":1},{"$f":"IF(MIN(Results!F20,Results!F26)=Results!F20,'Factor Results'!AF74,1)","v":1},{"$f":"IF(MIN(Results!G20,Results!G26)=Results!G20,'Factor Results'!AG74,1)","v":1},{"$f":"IF(MIN(Results!H20,Results!H26)=Results!H20,'Factor Results'!AH74,1)","v":1},{"$f":"IF(MIN(Results!I20,Results!I26)=Results!I20,'Factor Results'!AI74,1)","v":1},{"$f":"IF(MIN(Results!J20,Results!J26)=Results!J20,'Factor Results'!AJ74,1)","v":{"$error":"#VALUE!"}},{"$f":"IF(MIN(Results!L20,Results!L26)=Results!L20,'Factor Results'!AU74,1)","v":1},{"$f":"IF(MIN(Results!M20,Results!M26)=Results!M20,'Factor Results'!AV74,1)","v":1},{"$f":"IF(MIN(Results!N20,Results!N26)=Results!N20,'Factor Results'!AW74,1)","v":1},{"$f":"IF(MIN(Results!O20,Results!O26)=Results!O20,'Factor Results'!AX74,1)","v":1},{"$f":"IF(MIN(Results!P20,Results!P26)=Results!P20,'Factor Results'!AY74,1)","v":1},{"$f":"IF(MIN(Results!Q20,Results!Q26)=Results!Q20,'Factor Results'!AZ74,1)","v":{"$error":"#VALUE!"}}]
["Inverted","40 mil",{"$f":"Q51/Q52","v":1},{"$f":"R51/R52","v":1},{"$f":"S51/S52","v":1},{"$f":"T51/T52","v":0.59703929066867578},{"$f":"U51/U52","v":6.973892135811785E-2},{"$f":"IF(Input!$B$33=\"No\",\"\",V51/V52)","v":""},{"$f":"W51/W52","v":1},{"$f":"X51/X52","v":1},{"$f":"Y51/Y52","v":1},{"$f":"Z51/Z52","v":0.80913269140061472},{"$f":"AA51/AA52","v":0.40614739464444699},{"$f":"IF(Input!$B$33=\"No\",\"\",AB51/AB52)","v":""}]
[null,"90 mil",{"$f":"Q55/Q56","v":1},{"$f":"R55/R56","v":1},{"$f":"S55/S56","v":1},{"$f":"T55/T56","v":0.59703929066867578},{"$f":"U55/U56","v":6.973892135811785E-2},{"$f":"IF(Input!$B$33=\"No\",\"\",V55/V56)","v":""},{"$f":"W55/W56","v":1},{"$f":"X55/X56","v":1},{"$f":"Y55/Y56","v":1},{"$f":"Z55/Z56","v":0.80913269140061472},{"$f":"AA55/AA56","v":0.40614739464444699},{"$f":"IF(Input!$B$33=\"No\",\"\",AB55/AB56)","v":""}]
[null,"Tape",{"$f":"Q57/Q58","v":1},{"$f":"R57/R58","v":1},{"$f":"S57/S58","v":1},{"$f":"T57/T58","v":0.59703929066867578},{"$f":"U57/U58","v":6.973892135811785E-2},{"$f":"IF(Input!$B$33=\"No\",\"\",V57/V58)","v":""},{"$f":"W57/W58","v":1},{"$f":"X57/X58","v":1},{"$f":"Y57/Y58","v":1},{"$f":"Z57/Z58","v":0.80913269140061472},{"$f":"AA57/AA58","v":0.40614739464444699},{"$f":"IF(Input!$B$33=\"No\",\"\",AB57/AB58)","v":""}]
[null,"Inverted",1,1,1,1,1,{"$f":"IF(Input!$B$33=\"No\",\"\",1)","v":""},1,1,1,1,1,{"$f":"IF(Input!$B$33=\"No\",\"\",1)","v":""}]
[]
[null,null,null,null,null,null,null,"Number of lanes in one direction=",{"$f":"Input!B26","v":"2"}]

{"sheet":"Intermediate Factor Output","index":12,"n_rows":64,"n_cols":14,"rows_kept":64,"cut":false,"hidden":true,"merged":[]}
["Equivalent Cost Factors for Restripe-PCC",null,null,null,"Yellow Edge Line"]
["Reference Material","Material","Off-Peak Application",null,null,null,null,null,"Night Time Application"]
[null,null,"ADT per Lane",null,null,null,null,"User ADT","ADT per Lane",null,null,null,null,"User ADT"]
[null,null,5000,10000,15000,20000,25000,"",5000,10000,15000,20000,25000,""]
["40 mil","40 mil",1,1,1,1,1,"",1,1,1,1,1,""]
[null,"90 mil",1,0.9938935067771707,0.96039654070883884,0.83626453388092892,0.47101390048704794,"",1,0.99398345625774764,0.9717440030251876,0.94299791162588176,0.9070375856158589,""]
[null,"Tape",1,0.99394294969369323,0.96527587323897723,0.88162273715074224,0.47121072603076386,"",1,0.99399485346643512,0.9718237276733549,0.94321136386567672,0.90943863770556688,""]
[null,"Inverted",1,0.99392475293691185,0.96348010483469293,0.86492930053744843,0.47101390048704794,"",1,0.99399065888712912,0.97179438615925684,0.94313280582814174,0.90855496489722554,""]
["90 mil","40 mil",1,1.0061440115879521,1.0412365701171009,1.1957938660380694,2.1230795926955839,"",1,1.0060529616507945,1.0290776139465201,1.0604477355372266,1.1024901457870917,""]
[null,"90 mil",1,1,1,1,1,"",1,1,1,1,1,""]
[null,"Tape",1,1,1,1,1,"",1,1,1,1,1,""]
[null,"Inverted",1,1,1,1,1,"",1,1,1,1,1,""]
["Tape","40 mil",1,1.0060939617391254,1.0359732670459338,1.1342720166585465,2.1221927786395787,"",1,1.0060414261830659,1.0289931924116547,1.0602077522704769,1.0995794092528457,""]
[null,"90 mil",1,1,1,1,1,"",1,1,1,1,1,""]
[null,"Tape",1,1,1,1,1,"",1,1,1,1,1,""]
[null,"Inverted",1,1,1,1,1,"",1,1,1,1,1,""]
["Inverted","40 mil",1,1.006112381289566,1.0379041507780515,1.1561638614608403,2.1230795926955839,"",1,1.006045671615867,1.0290242609367377,1.0602960620396664,1.1006488750112313,""]
[null,"90 mil",1,1,1,1,1,"",1,1,1,1,1,""]
[null,"Tape",1,1,1,1,1,"",1,1,1,1,1,""]
[null,"Inverted",1,1,1,1,1,"",1,1,1,1,1,""]
[]
["Bidding Factors for Restripe-PCC: White Edge Line"]
["Reference Material","Material","Off-Peak Application",null,null,null,null,null,"Night Time Application"]
[null,null,"ADT per Lane",null,null,null,null,"User ADT","ADT per Lane",null,null,null,null,"User ADT"]
[null,null,5000,10000,15000,20000,25000,"",5000,10000,15000,20000,25000,""]
["40 mil","40 mil",1,1,1,1,1,"",1,1,1,1,1,""]
[null,"90 mil",1,1,1,1,1,"",1,1,1,1,1,""]
[null,"Tape",1,1,1,1,1,"",1,1,1,1,1,""]
[null,"Inverted",1,1,1,1.5589918631002146,11.19418836617262,"",1,1,1,1.2353456297027765,2.4388266962374989,""]
["90 mil","40 mil",1,1,1,1,1,"",1,1,1,1,1,""]
[null,"90 mil",1,1,1,1,1,"",1,1,1,1,1,""]
[null,"Tape",1,1,1,1,1,"",1,1,1,1,1,""]
[null,"Inverted",1,1,1,1.5589918631002146,11.19418836617262,"",1,1,1,1.2353456297027765,2.4388266962374989,""]
["Tape","40 mil",1,1,1,1,1,"",1,1,1,1,1,""]
[null,"90 mil",1,1,1,1,1,"",1,1,1,1,1,""]
[null,"Tape",1,1,1,1,1,"",1,1,1,1,1,""]
[null,"Inverted",1,1,1,1.5589918631002146,11.19418836617262,"",1,1,1,1.2353040911345419,2.4388266962374989,""]
["Inverted","40 mil",1,1,1,0.64144016634660161,8.9332068327693137E-2,"",1,1,1,0.80949005359787407,0.41003323505632872,""]
[null,"90 mil",1,1,1,0.64144016634660161,8.9332068327693137E-2,"",1,1,1,0.80949005359787407,0.41003323505632872,""]
[null,"Tape",1,1,1,0.64144016634660161,8.9332068327693137E-2,"",1,1,1,0.80951727366301263,0.41003323505632872,""]
[null,"Inverted",1,1,1,1,1,"",1,1,1,1,1,""]
[]
["Bidding Factors for Restripe-PCC: White Edge Line"]
["Reference Material","Material","Off-Peak Application",null,null,null,null,null,"Night Time Application"]
[null,null,"ADT per Lane",null,null,null,null,"User ADT","ADT per Lane",null,null,null,null,"User ADT"]
[null,null,5000,10000,15000,20000,25000,"",5000,10000,15000,20000,25000,""]
["40 mil","40 mil",1,1,1,1,1,"",1,1,1,1,1,""]
[null,"90 mil",1,1,1,1,1,"",1,1,1,1,1,""]
[null,"Tape",1,1,1,1,1,"",1,1,1,1,1,""]
[null,"Inverted",1,1,1,1.6749316429074772,14.339195108351021,"",1,1,1,1.2358912334502177,2.4621603220560568,""]
["90 mil","40 mil",1,1,1,1,1,"",1,1,1,1,1,""]
[null,"90 mil",1,1,1,1,1,"",1,1,1,1,1,""]
[null,"Tape",1,1,1,1,1,"",1,1,1,1,1,""]
[null,"Inverted",1,1,1,1.6749316429074772,14.339195108351021,"",1,1,1,1.2358912334502177,2.4621603220560568,""]
["Tape","40 mil",1,1,1,1,1,"",1,1,1,1,1,""]
[null,"90 mil",1,1,1,1,1,"",1,1,1,1,1,""]
[null,"Tape",1,1,1,1,1,"",1,1,1,1,1,""]
[null,"Inverted",1,1,1,1.6749316429074772,14.339195108351021,"",1,1,1,1.2358912334502177,2.4621603220560568,""]
["Inverted","40 mil",1,1,1,0.59703929066867578,6.973892135811785E-2,"",1,1,1,0.80913269140061472,0.40614739464444699,""]
[null,"90 mil",1,1,1,0.59703929066867578,6.973892135811785E-2,"",1,1,1,0.80913269140061472,0.40614739464444699,""]
[null,"Tape",1,1,1,0.59703929066867578,6.973892135811785E-2,"",1,1,1,0.80913269140061472,0.40614739464444699,""]
[null,"Inverted",1,1,1,1,1,"",1,1,1,1,1,""]
[]
[null,null,null,null,null,null,null,"Number of lanes in one direction=","2"]

{"sheet":"Factors for New Stripe-PCC","index":13,"n_rows":64,"n_cols":28,"rows_kept":64,"cut":false,"hidden":true,"merged":[[12,0,15,0],[0,15,0,27],[1,0,3,0],[1,1,3,1],[1,2,1,7],[1,8,1,13],[1,15,3,15],[1,16,1,21],[1,22,1,27],[2,2,2,6],[2,8,2,12],[2,16,2,20],[2,22,2,26],[4,0,7,0],[8,0,11,0],[29,0,32,0],[16,0,19,0],[21,0,21,13],[21,15,21,27],[22,0,24,0],[22,1,24,1],[22,2,22,7],[22,8,22,13],[22,15,24,15],[22,16,22,21],[22,22,22,27],[23,2,23,6],[23,8,23,12],[23,16,23,20],[23,22,23,26],[25,0,28,0],[33,0,36,0],[37,0,40,0],[42,0,42,13],[42,15,42,27],[43,0,45,0],[43,1,45,1],[43,2,43,7],[43,8,43,13],[43,15,45,15],[43,16,43,21],[50,0,53,0],[54,0,57,0],[58,0,61,0],[43,22,43,27],[44,2,44,6],[44,8,44,12],[44,16,44,20],[44,22,44,26],[46,0,49,0]]}
["Equivalent Cost Factors for New Stripe-PCC",null,null,null,"Yellow Edge Line",null,null,null,null,null,null,null,null,null,null,"Bidding Factors for New Stripe-PCC: Yellow Edge Line"]
["Reference Material","Material","Off-Peak Application",null,null,null,null,null,"Night Time Application",null,null,null,null,null,null,"Material","Off-Peak Application",null,null,null,null,null,"Night Time Application"]
[null,null,"ADT per Lane",null,null,null,null,"User ADT","ADT per Lane",null,null,null,null,"User ADT",null,null,"ADT per Lane",null,null,null,null,"User ADT","ADT per Lane",null,null,null,null,"User ADT"]
[null,null,5000,10000,15000,20000,25000,{"$f":"IF(Input!$B$33=\"No\",\"\",Input!$B$33)","v":""},5000,10000,15000,20000,25000,{"$f":"IF(Input!$B$33=\"No\",\"\",Input!$B$33)","v":""},null,null,5000,10000,15000,20000,25000,null,5000,10000,15000,20000,25000,{"$f":"IF(Input!$B$33=\"No\",\"\",Input!$B$33)","v":""}]
["40 mil","40 mil",1,1,1,1,1,{"$f":"IF(Input!$B$33=\"No\",\"\",1)","v":""},1,1,1,1,1,{"$f":"IF(Input!$B$33=\"No\",\"\",1)","v":""},null,"40 mil",{"$f":"IF(MIN(Results!E51,Results!E57)=Results!E51,1,'Factor Results'!AE140)","v":1},{"$f":"IF(MIN(Results!F51,Results!F57)=Results!F51,1,'Factor Results'!AF140)","v":1.0063968272077688},{"$f":"IF(MIN(Results!G51,Results!G57)=Results!G51,1,'Factor Results'!AG140)","v":1.0686533922381158},{"$f":"IF(MIN(Results!H51,Results!H57)=Results!H51,1,'Factor Results'!AH140)","v":1.6468586270887471},{"$f":"IF(MIN(Results!I51,Results!I57)=Results!I51,1,'Factor Results'!AI140)","v":1},{"$f":"IF(MIN(Results!J51,Results!J57)=Results!J51,1,'Factor Results'!AJ140)","v":1},{"$f":"IF(MIN(Results!L51,Results!L57)=Results!L51,1,'Factor Results'!AU140)","v":1},{"$f":"IF(MIN(Results!M51,Results!M57)=Results!M51,1,'Factor Results'!AV140)","v":1.0061112169921516},{"$f":"IF(MIN(Results!N51,Results!N57)=Results!N51,1,'Factor Results'!AW140)","v":1.0295041338017903},{"$f":"IF(MIN(Results!O51,Results!O57)=Results!O51,1,'Factor Results'!AX140)","v":1.0616612539472121},{"$f":"IF(MIN(Results!P51,Results!P57)=Results!P51,1,'Factor Results'!AY140)","v":1.1174272347156855},{"$f":"IF(MIN(Results!Q51,Results!Q57)=Results!Q51,1,'Factor Results'!AZ140)","v":1}]
[null,"90 mil",{"$f":"Q6/Q5","v":1},{"$f":"R6/R5","v":0.99364383209999108},0.93575710072436791,0.60721666301603638,0.13671100178224641,{"$f":"IF(Input!$B$33=\"No\",\"\",V6/V5)","v":""},{"$f":"W6/W5","v":1},{"$f":"X6/X5","v":0.99392590313184115},0.97134141298409715,0.94192002984194989,0.8949128577973462,{"$f":"IF(Input!$B$33=\"No\",\"\",AB6/AB5)","v":""},null,"90 mil",{"$f":"IF(MIN(Results!E51,Results!E57)=Results!E51,'Factor Results'!AE122,1)","v":1},{"$f":"IF(MIN(Results!F51,Results!F57)=Results!F51,'Factor Results'!AF122,1)","v":1},{"$f":"IF(MIN(Results!G51,Results!G57)=Results!G51,'Factor Results'!AG122,1)","v":1},{"$f":"IF(MIN(Results!H51,Results!H57)=Results!H51,'Factor Results'!AH122,1)","v":1},{"$f":"IF(MIN(Results!I51,Results!I57)=Results!I51,'Factor Results'!AI122,1)","v":0.13671100178224641},{"$f":"IF(MIN(Results!J51,Results!J57)=Results!J51,'Factor Results'!AJ122,1)","v":{"$error":"#VALUE!"}},{"$f":"IF(MIN(Results!L51,Results!L57)=Results!L51,'Factor Results'!AU122,1)","v":1},{"$f":"IF(MIN(Results!M51,Results!M57)=Results!M51,'Factor Results'!AV122,1)","v":1},{"$f":"IF(MIN(Results!N51,Results!N57)=Results!N51,'Factor Results'!AW122,1)","v":1},{"$f":"IF(MIN(Results!O51,Results!O57)=Results!O51,'Factor Results'!AX122,1)","v":1},{"$f":"IF(MIN(Results!P51,Results!P57)=Results!P51,'Factor Results'!AY122,1)","v":1},{"$f":"IF(MIN(Results!Q51,Results!Q57)=Results!Q51,'Factor Results'!AZ122,1)","v":{"$error":"#VALUE!"}}]
[null,"Tape",{"$f":"Q8/Q7","v":1},{"$f":"R8/R7","v":0.99389927368915887},0.96096565521990918,0.84155501398604238,0.18533337109740733,{"$f":"IF(Input!$B$33=\"No\",\"\",V8/V7)","v":""},{"$f":"W8/W7","v":1},{"$f":"X8/X7","v":0.99398478560285985},0.97175330193110998,0.94302280822113049,0.9073176389997285,{"$f":"IF(Input!$B$33=\"No\",\"\",AB8/AB7)","v":""},null,"40 mil",{"$f":"IF(MIN(Results!E51,Results!E63)=Results!E51,1,'Factor Results'!AE164)","v":1},{"$f":"IF(MIN(Results!F51,Results!F63)=Results!F51,1,'Factor Results'!AF164)","v":1.0061381736281951},{"$f":"IF(MIN(Results!G51,Results!G63)=Results!G51,1,'Factor Results'!AG164)","v":1.0406199166099834},{"$f":"IF(MIN(Results!H51,Results!H63)=Results!H51,1,'Factor Results'!AH164)","v":1.1882764446539029},{"$f":"IF(MIN(Results!I51,Results!I63)=Results!I51,1,'Factor Results'!AI164)","v":5.3956823537970449},{"$f":"IF(MIN(Results!J51,Results!J63)=Results!J51,1,'Factor Results'!AJ164)","v":1},{"$f":"IF(MIN(Results!L51,Results!L63)=Results!L51,1,'Factor Results'!AU164)","v":1},{"$f":"IF(MIN(Results!M51,Results!M63)=Results!M51,1,'Factor Results'!AV164)","v":1.0060516161658268},{"$f":"IF(MIN(Results!N51,Results!N63)=Results!N51,1,'Factor Results'!AW164)","v":1.0290677664925418},{"$f":"IF(MIN(Results!O51,Results!O63)=Results!O51,1,'Factor Results'!AX164)","v":1.0604197388251386},{"$f":"IF(MIN(Results!P51,Results!P63)=Results!P51,1,'Factor Results'!AY164)","v":1.1021498503020939},{"$f":"IF(MIN(Results!Q51,Results!Q63)=Results!Q51,1,'Factor Results'!AZ164)","v":1}]
[null,"Inverted",{"$f":"Q10/Q9","v":1},{"$f":"R10/R9","v":0.99383942883484988},0.95505979519122086,0.78665422622261372,0.13671100178224641,{"$f":"IF(Input!$B$33=\"No\",\"\",V10/V9)","v":""},{"$f":"W10/W9","v":1},{"$f":"X10/X9","v":0.99397099061782634},0.97165680459054038,0.94276444930764114,0.90441144691795972,{"$f":"IF(Input!$B$33=\"No\",\"\",AB10/AB9)","v":""},null,"Tape",{"$f":"IF(MIN(Results!E51,Results!E63)=Results!E51,'Factor Results'!AE128,1)","v":1},{"$f":"IF(MIN(Results!F51,Results!F63)=Results!F51,'Factor Results'!AF128,1)","v":1},{"$f":"IF(MIN(Results!G51,Results!G63)=Results!G51,'Factor Results'!AG128,1)","v":1},{"$f":"IF(MIN(Results!H51,Results!H63)=Results!H51,'Factor Results'!AH128,1)","v":1},{"$f":"IF(MIN(Results!I51,Results!I63)=Results!I51,'Factor Results'!AI128,1)","v":1},{"$f":"IF(MIN(Results!J51,Results!J63)=Results!J51,'Factor Results'!AJ128,1)","v":{"$error":"#VALUE!"}},{"$f":"IF(MIN(Results!L51,Results!L63)=Results!L51,'Factor Results'!AU128,1)","v":1},{"$f":"IF(MIN(Results!M51,Results!M63)=Results!M51,'Factor Results'!AV128,1)","v":1},{"$f":"IF(MIN(Results!N51,Results!N63)=Results!N51,'Factor Results'!AW128,1)","v":1},{"$f":"IF(MIN(Results!O51,Results!O63)=Results!O51,'Factor Results'!AX128,1)","v":1},{"$f":"IF(MIN(Results!P51,Results!P63)=Results!P51,'Factor Results'!AY128,1)","v":1},{"$f":"IF(MIN(Results!Q51,Results!Q63)=Results!Q51,'Factor Results'!AZ128,1)","v":{"$error":"#VALUE!"}}]
["90 mil","40 mil",{"$f":"Q5/Q6","v":1},{"$f":"R5/R6","v":1.0063968272077688},{"$f":"S5/S6","v":1.0686533922381158},{"$f":"T5/T6","v":1.6468586270887471},{"$f":"U5/U6","v":7.314700257941217},{"$f":"IF(Input!$B$33=\"No\",\"\",V5/V6)","v":""},{"$f":"W5/W6","v":1},{"$f":"X5/X6","v":1.0061112169921516},{"$f":"Y5/Y6","v":1.0295041338017903},{"$f":"Z5/Z6","v":1.0616612539472121},{"$f":"AA5/AA6","v":1.1174272347156855},{"$f":"IF(Input!$B$33=\"No\",\"\",AB5/AB6)","v":""},null,"40 mil",{"$f":"IF(MIN(Results!E51,Results!E69)=Results!E51,1,'Factor Results'!AE188)","v":1},{"$f":"IF(MIN(Results!F51,Results!F69)=Results!F51,1,'Factor Results'!AF188)","v":1.006198759061484},{"$f":"IF(MIN(Results!G51,Results!G69)=Results!G51,1,'Factor Results'!AG188)","v":1.0470548598475777},{"$f":"IF(MIN(Results!H51,Results!H69)=Results!H51,1,'Factor Results'!AH188)","v":1.2712065436956186},{"$f":"IF(MIN(Results!I51,Results!I69)=Results!I51,1,'Factor Results'!AI188)","v":1},{"$f":"IF(MIN(Results!J51,Results!J69)=Results!J51,1,'Factor Results'!AJ188)","v":1},{"$f":"IF(MIN(Results!L51,Results!L69)=Results!L51,1,'Factor Results'!AU188)","v":1},{"$f":"IF(MIN(Results!M51,Results!M69)=Results!M51,1,'Factor Results'!AV188)","v":1.00606557881375},{"$f":"IF(MIN(Results!N51,Results!N69)=Results!N51,1,'Factor Results'!AW188)","v":1.029169965440013},{"$f":"IF(MIN(Results!O51,Results!O69)=Results!O51,1,'Factor Results'!AX188)","v":1.0607103404613869},{"$f":"IF(MIN(Results!P51,Results!P69)=Results!P51,1,'Factor Results'!AY188)","v":1.1056914454231928},{"$f":"IF(MIN(Results!Q51,Results!Q69)=Results!Q51,1,'Factor Results'!AZ188)","v":1}]
[null,"90 mil",1,1,1,1,1,{"$f":"IF(Input!$B$33=\"No\",\"\",1)","v":""},1,1,1,1,1,{"$f":"IF(Input!$B$33=\"No\",\"\",1)","v":""},null,"Inverted",{"$f":"IF(MIN(Results!E51,Results!E69)=Results!E51,'Factor Results'!AE134,1)","v":1},{"$f":"IF(MIN(Results!F51,Results!F69)=Results!F51,'Factor Results'!AF134,1)","v":1},{"$f":"IF(MIN(Results!G51,Results!G69)=Results!G51,'Factor Results'!AG134,1)","v":1},{"$f":"IF(MIN(Results!H51,Results!H69)=Results!H51,'Factor Results'!AH134,1)","v":1},{"$f":"IF(MIN(Results!I51,Results!I69)=Results!I51,'Factor Results'!AI134,1)","v":0.13671100178224641},{"$f":"IF(MIN(Results!J51,Results!J69)=Results!J51,'Factor Results'!AJ134,1)","v":{"$error":"#VALUE!"}},{"$f":"IF(MIN(Results!L51,Results!L69)=Results!L51,'Factor Results'!AU134,1)","v":1},{"$f":"IF(MIN(Results!M51,Results!M69)=Results!M51,'Factor Results'!AV134,1)","v":1},{"$f":"IF(MIN(Results!N51,Results!N69)=Results!N51,'Factor Results'!AW134,1)","v":1},{"$f":"IF(MIN(Results!O51,Results!O69)=Results!O51,'Factor Results'!AX134,1)","v":1},{"$f":"IF(MIN(Results!P51,Results!P69)=Results!P51,'Factor Results'!AY134,1)","v":1},{"$f":"IF(MIN(Results!Q51,Results!Q69)=Results!Q51,'Factor Results'!AZ134,1)","v":{"$error":"#VALUE!"}}]
[null,"Tape",{"$f":"Q12/Q11","v":1},{"$f":"R12/R11","v":1},1,1,1,{"$f":"IF(Input!$B$33=\"No\",\"\",V12/V11)","v":""},{"$f":"W12/W11","v":1},{"$f":"X12/X11","v":1},1,1,1,{"$f":"IF(Input!$B$33=\"No\",\"\",AB12/AB11)","v":""},null,"90 mil",{"$f":"IF(MIN(Results!E57,Results!E63)=Results!E57,1,'Factor Results'!AE170)","v":1},{"$f":"IF(MIN(Results!F57,Results!F63)=Results!F57,1,'Factor Results'!AF170)","v":1},{"$f":"IF(MIN(Results!G57,Results!G63)=Results!G57,1,'Factor Results'!AG170)","v":1},{"$f":"IF(MIN(Results!H57,Results!H63)=Results!H57,1,'Factor Results'!AH170)","v":1},{"$f":"IF(MIN(Results!I57,Results!I63)=Results!I57,1,'Factor Results'!AI170)","v":1},{"$f":"IF(MIN(Results!J57,Results!J63)=Results!J57,1,'Factor Results'!AJ170)","v":1},{"$f":"IF(MIN(Results!L57,Results!L63)=Results!L57,1,'Factor Results'!AU170)","v":1},{"$f":"IF(MIN(Results!M57,Results!M63)=Results!M57,1,'Factor Results'!AV170)","v":1},{"$f":"IF(MIN(Results!N57,Results!N63)=Results!N57,1,'Factor Results'!AW170)","v":1},{"$f":"IF(MIN(Results!O57,Results!O63)=Results!O57,1,'Factor Results'!AX170)","v":1},{"$f":"IF(MIN(Results!P57,Results!P63)=Results!P57,1,'Factor Results'!AY170)","v":1},{"$f":"IF(MIN(Results!Q57,Results!Q63)=Results!Q57,1,'Factor Results'!AZ170)","v":1}]
[null,"Inverted",{"$f":"Q14/Q13","v":1},{"$f":"R14/R13","v":1},1,1,1,{"$f":"IF(Input!$B$33=\"No\",\"\",V14/V13)","v":""},{"$f":"W14/W13","v":1},{"$f":"X14/X13","v":1},1,1,1,{"$f":"IF(Input!$B$33=\"No\",\"\",AB14/AB13)","v":""},null,"Tape",{"$f":"IF(MIN(Results!E57,Results!E63)=Results!E57,'Factor Results'!AE152,1)","v":1},{"$f":"IF(MIN(Results!F57,Results!F63)=Results!F57,'Factor Results'!AF152,1)","v":1},{"$f":"IF(MIN(Results!G57,Results!G63)=Results!G57,'Factor Results'!AG152,1)","v":1},{"$f":"IF(MIN(Results!H57,Results!H63)=Results!H57,'Factor Results'!AH152,1)","v":1},{"$f":"IF(MIN(Results!I57,Results!I63)=Results!I57,'Factor Results'!AI152,1)","v":1},{"$f":"IF(MIN(Results!J57,Results!J63)=Results!J57,'Factor Results'!AJ152,1)","v":{"$error":"#VALUE!"}},{"$f":"IF(MIN(Results!L57,Results!L63)=Results!L57,'Factor Results'!AU152,1)","v":1},{"$f":"IF(MIN(Results!M57,Results!M63)=Results!M57,'Factor Results'!AV152,1)","v":1},{"$f":"IF(MIN(Results!N57,Results!N63)=Results!N57,'Factor Results'!AW152,1)","v":1},{"$f":"IF(MIN(Results!O57,Results!O63)=Results!O57,'Factor Results'!AX152,1)","v":1},{"$f":"IF(MIN(Results!P57,Results!P63)=Results!P57,'Factor Results'!AY152,1)","v":1},{"$f":"IF(MIN(Results!Q57,Results!Q63)=Results!Q57,'Factor Results'!AZ152,1)","v":{"$error":"#VALUE!"}}]
["Tape","40 mil",{"$f":"Q7/Q8","v":1},{"$f":"R7/R8","v":1.0061381736281951},{"$f":"S7/S8","v":1.0406199166099834},{"$f":"T7/T8","v":1.1882764446539029},{"$f":"U7/U8","v":5.3956823537970449},{"$f":"IF(Input!$B$33=\"No\",\"\",V7/V8)","v":""},{"$f":"W7/W8","v":1},{"$f":"X7/X8","v":1.0060516161658268},{"$f":"Y7/Y8","v":1.0290677664925418},{"$f":"Z7/Z8","v":1.0604197388251386},{"$f":"AA7/AA8","v":1.1021498503020939},{"$f":"IF(Input!$B$33=\"No\",\"\",AB7/AB8)","v":""},null,"90 mil",{"$f":"IF(MIN(Results!E57,Results!E69)=Results!E57,1,'Factor Results'!AE194)","v":1},{"$f":"IF(MIN(Results!F57,Results!F69)=Results!F57,1,'Factor Results'!AF194)","v":1},{"$f":"IF(MIN(Results!G57,Results!G69)=Results!G57,1,'Factor Results'!AG194)","v":1},{"$f":"IF(MIN(Results!H57,Results!H69)=Results!H57,1,'Factor Results'!AH194)","v":1},{"$f":"IF(MIN(Results!I57,Results!I69)=Results!I57,1,'Factor Results'!AI194)","v":1},{"$f":"IF(MIN(Results!J57,Results!J69)=Results!J57,1,'Factor Results'!AJ194)","v":1},{"$f":"IF(MIN(Results!L57,Results!L69)=Results!L57,1,'Factor Results'!AU194)","v":1},{"$f":"IF(MIN(Results!M57,Results!M69)=Results!M57,1,'Factor Results'!AV194)","v":1},{"$f":"IF(MIN(Results!N57,Results!N69)=Results!N57,1,'Factor Results'!AW194)","v":1},{"$f":"IF(MIN(Results!O57,Results!O69)=Results!O57,1,'Factor Results'!AX194)","v":1},{"$f":"IF(MIN(Results!P57,Results!P69)=Results!P57,1,'Factor Results'!AY194)","v":1},{"$f":"IF(MIN(Results!Q57,Results!Q69)=Results!Q57,1,'Factor Results'!AZ194)","v":1}]
[null,"90 mil",{"$f":"Q11/Q12","v":1},{"$f":"R11/R12","v":1},{"$f":"S11/S12","v":1},{"$f":"T11/T12","v":1},{"$f":"U11/U12","v":1},{"$f":"IF(Input!$B$33=\"No\",\"\",V11/V12)","v":""},{"$f":"W11/W12","v":1},{"$f":"X11/X12","v":1},{"$f":"Y11/Y12","v":1},{"$f":"Z11/Z12","v":1},{"$f":"AA11/AA12","v":1},{"$f":"IF(Input!$B$33=\"No\",\"\",AB11/AB12)","v":""},null,"Inverted",{"$f":"IF(MIN(Results!E57,Results!E69)=Results!E57,'Factor Results'!AE158,1)","v":1},{"$f":"IF(MIN(Results!F57,Results!F69)=Results!F57,'Factor Results'!AF158,1)","v":1},{"$f":"IF(MIN(Results!G57,Results!G69)=Results!G57,'Factor Results'!AG158,1)","v":1},{"$f":"IF(MIN(Results!H57,Results!H69)=Results!H57,'Factor Results'!AH158,1)","v":1},{"$f":"IF(MIN(Results!I57,Results!I69)=Results!I57,'Factor Results'!AI158,1)","v":1},{"$f":"IF(MIN(Results!J57,Results!J69)=Results!J57,'Factor Results'!AJ158,1)","v":{"$error":"#VALUE!"}},{"$f":"IF(MIN(Results!L57,Results!L69)=Results!L57,'Factor Results'!AU158,1)","v":1},{"$f":"IF(MIN(Results!M57,Results!M69)=Results!M57,'Factor Results'!AV158,1)","v":1},{"$f":"IF(MIN(Results!N57,Results!N69)=Results!N57,'Factor Results'!AW158,1)","v":1},{"$f":"IF(MIN(Results!O57,Results!O69)=Results!O57,'Factor Results'!AX158,1)","v":1},{"$f":"IF(MIN(Results!P57,Results!P69)=Results!P57,'Factor Results'!AY158,1)","v":1},{"$f":"IF(MIN(Results!Q57,Results!Q69)=Results!Q57,'Factor Results'!AZ158,1)","v":{"$error":"#VALUE!"}}]
[null,"Tape",1,1,1,1,1,{"$f":"IF(Input!$B$33=\"No\",\"\",1)","v":""},1,1,1,1,1,{"$f":"IF(Input!$B$33=\"No\",\"\",1)","v":""},null,"Tape",{"$f":"IF(MIN(Results!E63,Results!E69)=Results!E63,1,'Factor Results'!AE200)","v":1},{"$f":"IF(MIN(Results!F63,Results!F69)=Results!F63,1,'Factor Results'!AF200)","v":1},{"$f":"IF(MIN(Results!G63,Results!G69)=Results!G63,1,'Factor Results'!AG200)","v":1},{"$f":"IF(MIN(Results!H63,Results!H69)=Results!H63,1,'Factor Results'!AH200)","v":1},{"$f":"IF(MIN(Results!I63,Results!I69)=Results!I63,1,'Factor Results'!AI200)","v":1},{"$f":"IF(MIN(Results!J63,Results!J69)=Results!J63,1,'Factor Results'!AJ200)","v":1},{"$f":"IF(MIN(Results!L63,Results!L69)=Results!L63,1,'Factor Results'!AU200)","v":1},{"$f":"IF(MIN(Results!M63,Results!M69)=Results!M63,1,'Factor Results'!AV200)","v":1},{"$f":"IF(MIN(Results!N63,Results!N69)=Results!N63,1,'Factor Results'!AW200)","v":1},{"$f":"IF(MIN(Results!O63,Results!O69)=Results!O63,1,'Factor Results'!AX200)","v":1},{"$f":"IF(MIN(Results!P63,Results!P69)=Results!P63,1,'Factor Results'!AY200)","v":1},{"$f":"IF(MIN(Results!Q63,Results!Q69)=Results!Q63,1,'Factor Results'!AZ200)","v":1}]
[null,"Inverted",{"$f":"Q16/Q15","v":1},{"$f":"R16/R15","v":1},1,1,1,{"$f":"IF(Input!$B$33=\"No\",\"\",V16/V15)","v":""},{"$f":"W16/W15","v":1},{"$f":"X16/X15","v":1},1,1,1,{"$f":"IF(Input!$B$33=\"No\",\"\",AB16/AB15)","v":""},null,"Inverted",{"$f":"IF(MIN(Results!E63,Results!E69)=Results!E63,'Factor Results'!AE182,1)","v":1},{"$f":"IF(MIN(Results!F63,Results!F69)=Results!F63,'Factor Results'!AF182,1)","v":1},{"$f":"IF(MIN(Results!G63,Results!G69)=Results!G63,'Factor Results'!AG182,1)","v":1},{"$f":"IF(MIN(Results!H63,Results!H69)=Results!H63,'Factor Results'!AH182,1)","v":1},{"$f":"IF(MIN(Results!I63,Results!I69)=Results!I63,'Factor Results'!AI182,1)","v":1},{"$f":"IF(MIN(Results!J63,Results!J69)=Results!J63,'Factor Results'!AJ182,1)","v":{"$error":"#VALUE!"}},{"$f":"IF(MIN(Results!L63,Results!L69)=Results!L63,'Factor Results'!AU182,1)","v":1},{"$f":"IF(MIN(Results!M63,Results!M69)=Results!M63,'Factor Results'!AV182,1)","v":1},{"$f":"IF(MIN(Results!N63,Results!N69)=Results!N63,'Factor Results'!AW182,1)","v":1},{"$f":"IF(MIN(Results!O63,Results!O69)=Results!O63,'Factor Results'!AX182,1)","v":1},{"$f":"IF(MIN(Results!P63,Results!P69)=Results!P63,'Factor Results'!AY182,1)","v":1},{"$f":"IF(MIN(Results!Q63,Results!Q69)=Results!Q63,'Factor Results'!AZ182,1)","v":{"$error":"#VALUE!"}}]
["Inverted","40 mil",{"$f":"Q9/Q10","v":1},{"$f":"R9/R10","v":1.006198759061484},{"$f":"S9/S10","v":1.0470548598475777},{"$f":"T9/T10","v":1.2712065436956186},{"$f":"U9/U10","v":7.314700257941217},{"$f":"IF(Input!$B$33=\"No\",\"\",V9/V10)","v":""},{"$f":"W9/W10","v":1},{"$f":"X9/X10","v":1.00606557881375},{"$f":"Y9/Y10","v":1.029169965440013},{"$f":"Z9/Z10","v":1.0607103404613869},{"$f":"AA9/AA10","v":1.1056914454231928},{"$f":"IF(Input!$B$33=\"No\",\"\",AB9/AB10)","v":""}]
[null,"90 mil",{"$f":"Q13/Q14","v":1},{"$f":"R13/R14","v":1},{"$f":"S13/S14","v":1},{"$f":"T13/T14","v":1},{"$f":"U13/U14","v":1},{"$f":"IF(Input!$B$33=\"No\",\"\",V13/V14)","v":""},{"$f":"W13/W14","v":1},{"$f":"X13/X14","v":1},{"$f":"Y13/Y14","v":1},{"$f":"Z13/Z14","v":1},{"$f":"AA13/AA14","v":1},{"$f":"IF(Input!$B$33=\"No\",\"\",AB13/AB14)","v":""}]
[null,"Tape",{"$f":"Q15/Q16","v":1},{"$f":"R15/R16","v":1},{"$f":"S15/S16","v":1},{"$f":"T15/T16","v":1},{"$f":"U15/U16","v":1},{"$f":"IF(Input!$B$33=\"No\",\"\",V15/V16)","v":""},{"$f":"W15/W16","v":1},{"$f":"X15/X16","v":1},{"$f":"Y15/Y16","v":1},{"$f":"Z15/Z16","v":1},{"$f":"AA15/AA16","v":1},{"$f":"IF(Input!$B$33=\"No\",\"\",AB15/AB16)","v":""}]
[null,"Inverted",1,1,1,1,1,{"$f":"IF(Input!$B$33=\"No\",\"\",1)","v":""},1,1,1,1,1,{"$f":"IF(Input!$B$33=\"No\",\"\",1)","v":""}]
[]
["Bidding Factors for New Stripe-PCC: White Edge Line",null,null,null,null,null,null,null,null,null,null,null,null,null,null,"Bidding Factors for New Stripe-PCC: White Edge Line"]
["Reference Material","Material","Off-Peak Application",null,null,null,null,null,"Night Time Application",null,null,null,null,null,null,"Material","Off-Peak Application",null,null,null,null,null,"Night Time Application"]
[null,null,"ADT per Lane",null,null,null,null,"User ADT","ADT per Lane",null,null,null,null,"User ADT",null,null,"ADT per Lane",null,null,null,null,"User ADT","ADT per Lane",null,null,null,null,"User ADT"]
[null,null,5000,10000,15000,20000,25000,{"$f":"IF(Input!$B$33=\"No\",\"\",Input!$B$33)","v":""},5000,10000,15000,20000,25000,{"$f":"IF(Input!$B$33=\"No\",\"\",Input!$B$33)","v":""},null,null,5000,10000,15000,20000,25000,null,5000,10000,15000,20000,25000,{"$f":"IF(Input!$B$33=\"No\",\"\",Input!$B$33)","v":""}]
["40 mil","40 mil",1,1,1,1,1,{"$f":"IF(Input!$B$33=\"No\",\"\",1)","v":""},1,1,1,1,1,{"$f":"IF(Input!$B$33=\"No\",\"\",1)","v":""},null,"40 mil",{"$f":"IF(MIN(Results!E52,Results!E58)=Results!E52,1,'Factor Results'!AE141)","v":1},{"$f":"IF(MIN(Results!F52,Results!F58)=Results!F52,1,'Factor Results'!AF141)","v":1},{"$f":"IF(MIN(Results!G52,Results!G58)=Results!G52,1,'Factor Results'!AG141)","v":1},{"$f":"IF(MIN(Results!H52,Results!H58)=Results!H52,1,'Factor Results'!AH141)","v":1},{"$f":"IF(MIN(Results!I52,Results!I58)=Results!I52,1,'Factor Results'!AI141)","v":1},{"$f":"IF(MIN(Results!J52,Results!J58)=Results!J52,1,'Factor Results'!AJ141)","v":1},{"$f":"IF(MIN(Results!L52,Results!L58)=Results!L52,1,'Factor Results'!AU141)","v":1},{"$f":"IF(MIN(Results!M52,Results!M58)=Results!M52,1,'Factor Results'!AV141)","v":1},{"$f":"IF(MIN(Results!N52,Results!N58)=Results!N52,1,'Factor Results'!AW141)","v":1},{"$f":"IF(MIN(Results!O52,Results!O58)=Results!O52,1,'Factor Results'!AX141)","v":1},{"$f":"IF(MIN(Results!P52,Results!P58)=Results!P52,1,'Factor Results'!AY141)","v":1},{"$f":"IF(MIN(Results!Q52,Results!Q58)=Results!Q52,1,'Factor Results'!AZ141)","v":1}]
[null,"90 mil",{"$f":"Q27/Q26","v":1},{"$f":"R27/R26","v":1},{"$f":"S27/S26","v":1},{"$f":"T27/T26","v":1},{"$f":"U27/U26","v":1},{"$f":"IF(Input!$B$33=\"No\",\"\",V27/V26)","v":""},{"$f":"W27/W26","v":1},{"$f":"X27/X26","v":1},{"$f":"Y27/Y26","v":1},{"$f":"Z27/Z26","v":1},{"$f":"AA27/AA26","v":1},{"$f":"IF(Input!$B$33=\"No\",\"\",AB27/AB26)","v":""},null,"90 mil",{"$f":"IF(MIN(Results!E52,Results!E58)=Results!E52,'Factor Results'!AE123,1)","v":1},{"$f":"IF(MIN(Results!F52,Results!F58)=Results!F52,'Factor Results'!AF123,1)","v":1},{"$f":"IF(MIN(Results!G52,Results!G58)=Results!G52,'Factor Results'!AG123,1)","v":1},{"$f":"IF(MIN(Results!H52,Results!H58)=Results!H52,'Factor Results'!AH123,1)","v":1},{"$f":"IF(MIN(Results!I52,Results!I58)=Results!I52,'Factor Results'!AI123,1)","v":1},{"$f":"IF(MIN(Results!J52,Results!J58)=Results!J52,'Factor Results'!AJ123,1)","v":{"$error":"#VALUE!"}},{"$f":"IF(MIN(Results!L52,Results!L58)=Results!L52,'Factor Results'!AU123,1)","v":1},{"$f":"IF(MIN(Results!M52,Results!M58)=Results!M52,'Factor Results'!AV123,1)","v":1},{"$f":"IF(MIN(Results!N52,Results!N58)=Results!N52,'Factor Results'!AW123,1)","v":1},{"$f":"IF(MIN(Results!O52,Results!O58)=Results!O52,'Factor Results'!AX123,1)","v":1},{"$f":"IF(MIN(Results!P52,Results!P58)=Results!P52,'Factor Results'!AY123,1)","v":1},{"$f":"IF(MIN(Results!Q52,Results!Q58)=Results!Q52,'Factor Results'!AZ123,1)","v":{"$error":"#VALUE!"}}]
[null,"Tape",{"$f":"Q29/Q28","v":1},{"$f":"R29/R28","v":1},{"$f":"S29/S28","v":1},{"$f":"T29/T28","v":1},{"$f":"U29/U28","v":1},{"$f":"IF(Input!$B$33=\"No\",\"\",V29/V28)","v":""},{"$f":"W29/W28","v":1},{"$f":"X29/X28","v":1},{"$f":"Y29/Y28","v":1},{"$f":"Z29/Z28","v":1},{"$f":"AA29/AA28","v":1},{"$f":"IF(Input!$B$33=\"No\",\"\",AB29/AB28)","v":""},null,"40 mil",{"$f":"IF(MIN(Results!E52,Results!E64)=Results!E52,1,'Factor Results'!AE165)","v":1},{"$f":"IF(MIN(Results!F52,Results!F64)=Results!F52,1,'Factor Results'!AF165)","v":1},{"$f":"IF(MIN(Results!G52,Results!G64)=Results!G52,1,'Factor Results'!AG165)","v":1},{"$f":"IF(MIN(Results!H52,Results!H64)=Results!H52,1,'Factor Results'!AH165)","v":1},{"$f":"IF(MIN(Results!I52,Results!I64)=Results!I52,1,'Factor Results'!AI165)","v":1},{"$f":"IF(MIN(Results!J52,Results!J64)=Results!J52,1,'Factor Results'!AJ165)","v":1},{"$f":"IF(MIN(Results!L52,Results!L64)=Results!L52,1,'Factor Results'!AU165)","v":1},{"$f":"IF(MIN(Results!M52,Results!M64)=Results!M52,1,'Factor Results'!AV165)","v":1},{"$f":"IF(MIN(Results!N52,Results!N64)=Results!N52,1,'Factor Results'!AW165)","v":1},{"$f":"IF(MIN(Results!O52,Results!O64)=Results!O52,1,'Factor Results'!AX165)","v":1},{"$f":"IF(MIN(Results!P52,Results!P64)=Results!P52,1,'Factor Results'!AY165)","v":1},{"$f":"IF(MIN(Results!Q52,Results!Q64)=Results!Q52,1,'Factor Results'!AZ165)","v":1}]
[null,"Inverted",{"$f":"Q31/Q30","v":1},{"$f":"R31/R30","v":1},{"$f":"S31/S30","v":1},{"$f":"T31/T30","v":1.8829342858437075},{"$f":"U31/U30","v":19.981518351614522},{"$f":"IF(Input!$B$33=\"No\",\"\",V31/V30)","v":""},{"$f":"W31/W30","v":1},{"$f":"X31/X30","v":1},{"$f":"Y31/Y30","v":1},{"$f":"Z31/Z30","v":1.236870077999106},{"$f":"AA31/AA30","v":2.5040221907573206},{"$f":"IF(Input!$B$33=\"No\",\"\",AB31/AB30)","v":""},null,"Tape",{"$f":"IF(MIN(Results!E52,Results!E64)=Results!E52,'Factor Results'!AE129,1)","v":1},{"$f":"IF(MIN(Results!F52,Results!F64)=Results!F52,'Factor Results'!AF129,1)","v":1},{"$f":"IF(MIN(Results!G52,Results!G64)=Results!G52,'Factor Results'!AG129,1)","v":1},{"$f":"IF(MIN(Results!H52,Results!H64)=Results!H52,'Factor Results'!AH129,1)","v":1},{"$f":"IF(MIN(Results!I52,Results!I64)=Results!I52,'Factor Results'!AI129,1)","v":1},{"$f":"IF(MIN(Results!J52,Results!J64)=Results!J52,'Factor Results'!AJ129,1)","v":{"$error":"#VALUE!"}},{"$f":"IF(MIN(Results!L52,Results!L64)=Results!L52,'Factor Results'!AU129,1)","v":1},{"$f":"IF(MIN(Results!M52,Results!M64)=Results!M52,'Factor Results'!AV129,1)","v":1},{"$f":"IF(MIN(Results!N52,Results!N64)=Results!N52,'Factor Results'!AW129,1)","v":1},{"$f":"IF(MIN(Results!O52,Results!O64)=Results!O52,'Factor Results'!AX129,1)","v":1},{"$f":"IF(MIN(Results!P52,Results!P64)=Results!P52,'Factor Results'!AY129,1)","v":1},{"$f":"IF(MIN(Results!Q52,Results!Q64)=Results!Q52,'Factor Results'!AZ129,1)","v":{"$error":"#VALUE!"}}]
["90 mil","40 mil",{"$f":"Q26/Q27","v":1},{"$f":"R26/R27","v":1},{"$f":"S26/S27","v":1},{"$f":"T26/T27","v":1},{"$f":"U26/U27","v":1},{"$f":"IF(Input!$B$33=\"No\",\"\",V26/V27)","v":""},{"$f":"W26/W27","v":1},{"$f":"X26/X27","v":1},{"$f":"Y26/Y27","v":1},{"$f":"Z26/Z27","v":1},{"$f":"AA26/AA27","v":1},{"$f":"IF(Input!$B$33=\"No\",\"\",AB26/AB27)","v":""},null,"40 mil",{"$f":"IF(MIN(Results!E52,Results!E70)=Results!E52,1,'Factor Results'!AE189)","v":1},{"$f":"IF(MIN(Results!F52,Results!F70)=Results!F52,1,'Factor Results'!AF189)","v":1},{"$f":"IF(MIN(Results!G52,Results!G70)=Results!G52,1,'Factor Results'!AG189)","v":1},{"$f":"IF(MIN(Results!H52,Results!H70)=Results!H52,1,'Factor Results'!AH189)","v":0.53108597974884653},{"$f":"IF(MIN(Results!I52,Results!I70)=Results!I52,1,'Factor Results'!AI189)","v":5.0046246856871077E-2},{"$f":"IF(MIN(Results!J52,Results!J70)=Results!J52,1,'Factor Results'!AJ189)","v":1},{"$f":"IF(MIN(Results!L52,Results!L70)=Results!L52,1,'Factor Results'!AU189)","v":1},{"$f":"IF(MIN(Results!M52,Results!M70)=Results!M52,1,'Factor Results'!AV189)","v":1},{"$f":"IF(MIN(Results!N52,Results!N70)=Results!N52,1,'Factor Results'!AW189)","v":1},{"$f":"IF(MIN(Results!O52,Results!O70)=Results!O52,1,'Factor Results'!AX189)","v":0.8084923532289725},{"$f":"IF(MIN(Results!P52,Results!P70)=Results!P52,1,'Factor Results'!AY189)","v":0.39935748320886821},{"$f":"IF(MIN(Results!Q52,Results!Q70)=Results!Q52,1,'Factor Results'!AZ189)","v":1}]
[null,"90 mil",1,1,1,1,1,{"$f":"IF(Input!$B$33=\"No\",\"\",1)","v":""},1,1,1,1,1,{"$f":"IF(Input!$B$33=\"No\",\"\",1)","v":""},null,"Inverted",{"$f":"IF(MIN(Results!E52,Results!E70)=Results!E52,'Factor Results'!AE135,1)","v":1},{"$f":"IF(MIN(Results!F52,Results!F70)=Results!F52,'Factor Results'!AF135,1)","v":1},{"$f":"IF(MIN(Results!G52,Results!G70)=Results!G52,'Factor Results'!AG135,1)","v":1},{"$f":"IF(MIN(Results!H52,Results!H70)=Results!H52,'Factor Results'!AH135,1)","v":1},{"$f":"IF(MIN(Results!I52,Results!I70)=Results!I52,'Factor Results'!AI135,1)","v":1},{"$f":"IF(MIN(Results!J52,Results!J70)=Results!J52,'Factor Results'!AJ135,1)","v":{"$error":"#VALUE!"}},{"$f":"IF(MIN(Results!L52,Results!L70)=Results!L52,'Factor Results'!AU135,1)","v":1},{"$f":"IF(MIN(Results!M52,Results!M70)=Results!M52,'Factor Results'!AV135,1)","v":1},{"$f":"IF(MIN(Results!N52,Results!N70)=Results!N52,'Factor Results'!AW135,1)","v":1},{"$f":"IF(MIN(Results!O52,Results!O70)=Results!O52,'Factor Results'!AX135,1)","v":1},{"$f":"IF(MIN(Results!P52,Results!P70)=Results!P52,'Factor Results'!AY135,1)","v":1},{"$f":"IF(MIN(Results!Q52,Results!Q70)=Results!Q52,'Factor Results'!AZ135,1)","v":{"$error":"#VALUE!"}}]
[null,"Tape",{"$f":"Q33/Q32","v":1},{"$f":"R33/R32","v":1},{"$f":"S33/S32","v":1},{"$f":"T33/T32","v":1},{"$f":"U33/U32","v":1},{"$f":"IF(Input!$B$33=\"No\",\"\",V33/V32)","v":""},{"$f":"W33/W32","v":1},{"$f":"X33/X32","v":1},{"$f":"Y33/Y32","v":1},{"$f":"Z33/Z32","v":1},{"$f":"AA33/AA32","v":1},{"$f":"IF(Input!$B$33=\"No\",\"\",AB33/AB32)","v":""},null,"90 mil",{"$f":"IF(MIN(Results!E58,Results!E64)=Results!E58,1,'Factor Results'!AE171)","v":1},{"$f":"IF(MIN(Results!F58,Results!F64)=Results!F58,1,'Factor Results'!AF171)","v":1},{"$f":"IF(MIN(Results!G58,Results!G64)=Results!G58,1,'Factor Results'!AG171)","v":1},{"$f":"IF(MIN(Results!H58,Results!H64)=Results!H58,1,'Factor Results'!AH171)","v":1},{"$f":"IF(MIN(Results!I58,Results!I64)=Results!I58,1,'Factor Results'!AI171)","v":1},{"$f":"IF(MIN(Results!J58,Results!J64)=Results!J48,1,'Factor Results'!AJ171)","v":1},{"$f":"IF(MIN(Results!L58,Results!L64)=Results!L58,1,'Factor Results'!AU171)","v":1},{"$f":"IF(MIN(Results!M58,Results!M64)=Results!M58,1,'Factor Results'!AV171)","v":1},{"$f":"IF(MIN(Results!N58,Results!N64)=Results!N58,1,'Factor Results'!AW171)","v":1},{"$f":"IF(MIN(Results!O58,Results!O64)=Results!O58,1,'Factor Results'!AX171)","v":1},{"$f":"IF(MIN(Results!P58,Results!P64)=Results!P58,1,'Factor Results'!AY171)","v":1},{"$f":"IF(MIN(Results!Q58,Results!Q64)=Results!Q58,1,'Factor Results'!AZ171)","v":1}]
[null,"Inverted",{"$f":"Q35/Q34","v":1},{"$f":"R35/R34","v":1},{"$f":"S35/S34","v":1},{"$f":"T35/T34","v":1.8829342858437075},{"$f":"U35/U34","v":19.981518351614522},{"$f":"IF(Input!$B$33=\"No\",\"\",V35/V34)","v":""},{"$f":"W35/W34","v":1},{"$f":"X35/X34","v":1},{"$f":"Y35/Y34","v":1},{"$f":"Z35/Z34","v":1.236870077999106},{"$f":"AA35/AA34","v":2.5040221907573206},{"$f":"IF(Input!$B$33=\"No\",\"\",AB35/AB34)","v":""},null,"Tape",{"$f":"IF(MIN(Results!E58,Results!E64)=Results!E58,'Factor Results'!AE153,1)","v":1},{"$f":"IF(MIN(Results!F58,Results!F64)=Results!F58,'Factor Results'!AF153,1)","v":1},{"$f":"IF(MIN(Results!G58,Results!G64)=Results!G58,'Factor Results'!AG153,1)","v":1},{"$f":"IF(MIN(Results!H58,Results!H64)=Results!H58,'Factor Results'!AH153,1)","v":1},{"$f":"IF(MIN(Results!I58,Results!I64)=Results!I58,'Factor Results'!AI153,1)","v":1},{"$f":"IF(MIN(Results!J58,Results!J64)=Results!J48,'Factor Results'!AJ153,1)","v":{"$error":"#VALUE!"}},{"$f":"IF(MIN(Results!L58,Results!L64)=Results!L58,'Factor Results'!AU153,1)","v":1},{"$f":"IF(MIN(Results!M58,Results!M64)=Results!M58,'Factor Results'!AV153,1)","v":1},{"$f":"IF(MIN(Results!N58,Results!N64)=Results!N58,'Factor Results'!AW153,1)","v":1},{"$f":"IF(MIN(Results!O58,Results!O64)=Results!O58,'Factor Results'!AX153,1)","v":1},{"$f":"IF(MIN(Results!P58,Results!P64)=Results!P58,'Factor Results'!AY153,1)","v":1},{"$f":"IF(MIN(Results!Q58,Results!Q64)=Results!Q58,'Factor Results'!AZ153,1)","v":{"$error":"#VALUE!"}}]
["Tape","40 mil",{"$f":"Q28/Q29","v":1},{"$f":"R28/R29","v":1},{"$f":"S28/S29","v":1},{"$f":"T28/T29","v":1},{"$f":"U28/U29","v":1},{"$f":"IF(Input!$B$33=\"No\",\"\",V28/V29)","v":""},{"$f":"W28/W29","v":1},{"$f":"X28/X29","v":1},{"$f":"Y28/Y29","v":1},{"$f":"Z28/Z29","v":1},{"$f":"AA28/AA29","v":1},{"$f":"IF(Input!$B$33=\"No\",\"\",AB28/AB29)","v":""},null,"90 mil",{"$f":"IF(MIN(Results!E58,Results!E70)=Results!E58,1,'Factor Results'!AE195)","v":1},{"$f":"IF(MIN(Results!F58,Results!F70)=Results!F58,1,'Factor Results'!AF195)","v":1},{"$f":"IF(MIN(Results!G58,Results!G70)=Results!G58,1,'Factor Results'!AG195)","v":1},{"$f":"IF(MIN(Results!H58,Results!H70)=Results!H58,1,'Factor Results'!AH195)","v":0.53108597974884653},{"$f":"IF(MIN(Results!I58,Results!I70)=Results!I58,1,'Factor Results'!AI195)","v":5.0046246856871077E-2},{"$f":"IF(MIN(Results!J58,Results!J70)=Results!J48,1,'Factor Results'!AJ195)","v":1},{"$f":"IF(MIN(Results!L58,Results!L70)=Results!L58,1,'Factor Results'!AU195)","v":1},{"$f":"IF(MIN(Results!M58,Results!M70)=Results!M58,1,'Factor Results'!AV195)","v":1},{"$f":"IF(MIN(Results!N58,Results!N70)=Results!N58,1,'Factor Results'!AW195)","v":1},{"$f":"IF(MIN(Results!O58,Results!O70)=Results!O58,1,'Factor Results'!AX195)","v":0.8084923532289725},{"$f":"IF(MIN(Results!P58,Results!P70)=Results!P58,1,'Factor Results'!AY195)","v":0.39935748320886821},{"$f":"IF(MIN(Results!Q58,Results!Q70)=Results!Q58,1,'Factor Results'!AZ195)","v":1}]
[null,"90 mil",{"$f":"Q32/Q33","v":1},{"$f":"R32/R33","v":1},{"$f":"S32/S33","v":1},{"$f":"T32/T33","v":1},{"$f":"U32/U33","v":1},{"$f":"IF(Input!$B$33=\"No\",\"\",V32/V33)","v":""},{"$f":"W32/W33","v":1},{"$f":"X32/X33","v":1},{"$f":"Y32/Y33","v":1},{"$f":"Z32/Z33","v":1},{"$f":"AA32/AA33","v":1},{"$f":"IF(Input!$B$33=\"No\",\"\",AB32/AB33)","v":""},null,"Inverted",{"$f":"IF(MIN(Results!E58,Results!E70)=Results!E58,'Factor Results'!AE159,1)","v":1},{"$f":"IF(MIN(Results!F58,Results!F70)=Results!F58,'Factor Results'!AF159,1)","v":1},{"$f":"IF(MIN(Results!G58,Results!G70)=Results!G58,'Factor Results'!AG159,1)","v":1},{"$f":"IF(MIN(Results!H58,Results!H70)=Results!H58,'Factor Results'!AH159,1)","v":1},{"$f":"IF(MIN(Results!I58,Results!I70)=Results!I58,'Factor Results'!AI159,1)","v":1},{"$f":"IF(MIN(Results!J58,Results!J70)=Results!J48,'Factor Results'!AJ159,1)","v":{"$error":"#VALUE!"}},{"$f":"IF(MIN(Results!L58,Results!L70)=Results!L58,'Factor Results'!AU159,1)","v":1},{"$f":"IF(MIN(Results!M58,Results!M70)=Results!M58,'Factor Results'!AV159,1)","v":1},{"$f":"IF(MIN(Results!N58,Results!N70)=Results!N58,'Factor Results'!AW159,1)","v":1},{"$f":"IF(MIN(Results!O58,Results!O70)=Results!O58,'Factor Results'!AX159,1)","v":1},{"$f":"IF(MIN(Results!P58,Results!P70)=Results!P58,'Factor Results'!AY159,1)","v":1},{"$f":"IF(MIN(Results!Q58,Results!Q70)=Results!Q58,'Factor Results'!AZ159,1)","v":{"$error":"#VALUE!"}}]
[null,"Tape",1,1,1,1,1,{"$f":"IF(Input!$B$33=\"No\",\"\",1)","v":""},1,1,1,1,1,{"$f":"IF(Input!$B$33=\"No\",\"\",1)","v":""},null,"Tape",{"$f":"IF(MIN(Results!E64,Results!E70)=Results!E64,1,'Factor Results'!AE201)","v":1},{"$f":"IF(MIN(Results!F64,Results!F70)=Results!F64,1,'Factor Results'!AF201)","v":1},{"$f":"IF(MIN(Results!G64,Results!G70)=Results!G64,1,'Factor Results'!AG201)","v":1},{"$f":"IF(MIN(Results!H64,Results!H70)=Results!H64,1,'Factor Results'!AH201)","v":0.53108597974884653},{"$f":"IF(MIN(Results!I64,Results!I70)=Results!I64,1,'Factor Results'!AI201)","v":5.0046246856871077E-2},{"$f":"IF(MIN(Results!J64,Results!J70)=Results!J64,1,'Factor Results'!AJ201)","v":1},{"$f":"IF(MIN(Results!L64,Results!L70)=Results!L64,1,'Factor Results'!AU201)","v":1},{"$f":"IF(MIN(Results!M64,Results!M70)=Results!M64,1,'Factor Results'!AV201)","v":1},{"$f":"IF(MIN(Results!N64,Results!N70)=Results!N64,1,'Factor Results'!AW201)","v":1},{"$f":"IF(MIN(Results!O64,Results!O70)=Results!O64,1,'Factor Results'!AX201)","v":1},{"$f":"IF(MIN(Results!P64,Results!P70)=Results!P64,1,'Factor Results'!AY201)","v":0.39935748320886821},{"$f":"IF(MIN(Results!Q64,Results!Q70)=Results!Q64,1,'Factor Results'!AZ201)","v":1}]
[null,"Inverted",{"$f":"Q37/Q36","v":1},{"$f":"R37/R36","v":1},{"$f":"S37/S36","v":1},{"$f":"T37/T36","v":1.8829342858437075},{"$f":"U37/U36","v":19.981518351614522},{"$f":"IF(Input!$B$33=\"No\",\"\",V37/V36)","v":""},{"$f":"W37/W36","v":1},{"$f":"X37/X36","v":1},{"$f":"Y37/Y36","v":1},{"$f":"Z37/Z36","v":1.2362699660695919},{"$f":"AA37/AA36","v":2.5040221907573206},{"$f":"IF(Input!$B$33=\"No\",\"\",AB37/AB36)","v":""},null,"Inverted",{"$f":"IF(MIN(Results!E64,Results!E70)=Results!E64,'Factor Results'!AE183,1)","v":1},{"$f":"IF(MIN(Results!F64,Results!F70)=Results!F64,'Factor Results'!AF183,1)","v":1},{"$f":"IF(MIN(Results!G64,Results!G70)=Results!G64,'Factor Results'!AG183,1)","v":1},{"$f":"IF(MIN(Results!H64,Results!H70)=Results!H64,'Factor Results'!AH183,1)","v":1},{"$f":"IF(MIN(Results!I64,Results!I70)=Results!I64,'Factor Results'!AI183,1)","v":1},{"$f":"IF(MIN(Results!J64,Results!J70)=Results!J64,'Factor Results'!AJ183,1)","v":{"$error":"#VALUE!"}},{"$f":"IF(MIN(Results!L64,Results!L70)=Results!L64,'Factor Results'!AU183,1)","v":1},{"$f":"IF(MIN(Results!M64,Results!M70)=Results!M64,'Factor Results'!AV183,1)","v":1},{"$f":"IF(MIN(Results!N64,Results!N70)=Results!N64,'Factor Results'!AW183,1)","v":1},{"$f":"IF(MIN(Results!O64,Results!O70)=Results!O64,'Factor Results'!AX183,1)","v":1.2362699660695919},{"$f":"IF(MIN(Results!P64,Results!P70)=Results!P64,'Factor Results'!AY183,1)","v":1},{"$f":"IF(MIN(Results!Q64,Results!Q70)=Results!Q64,'Factor Results'!AZ183,1)","v":{"$error":"#VALUE!"}}]
["Inverted","40 mil",{"$f":"Q30/Q31","v":1},{"$f":"R30/R31","v":1},{"$f":"S30/S31","v":1},{"$f":"T30/T31","v":0.53108597974884653},{"$f":"U30/U31","v":5.0046246856871077E-2},{"$f":"IF(Input!$B$33=\"No\",\"\",V30/V31)","v":""},{"$f":"W30/W31","v":1},{"$f":"X30/X31","v":1},{"$f":"Y30/Y31","v":1},{"$f":"Z30/Z31","v":0.8084923532289725},{"$f":"AA30/AA31","v":0.39935748320886821},{"$f":"IF(Input!$B$33=\"No\",\"\",AB30/AB31)","v":""}]
[null,"90 mil",{"$f":"Q34/Q35","v":1},{"$f":"R34/R35","v":1},{"$f":"S34/S35","v":1},{"$f":"T34/T35","v":0.53108597974884653},{"$f":"U34/U35","v":5.0046246856871077E-2},{"$f":"IF(Input!$B$33=\"No\",\"\",V34/V35)","v":""},{"$f":"W34/W35","v":1},{"$f":"X34/X35","v":1},{"$f":"Y34/Y35","v":1},{"$f":"Z34/Z35","v":0.8084923532289725},{"$f":"AA34/AA35","v":0.39935748320886821},{"$f":"IF(Input!$B$33=\"No\",\"\",AB34/AB35)","v":""}]
[null,"Tape",{"$f":"Q36/Q37","v":1},{"$f":"R36/R37","v":1},{"$f":"S36/S37","v":1},{"$f":"T36/T37","v":0.53108597974884653},{"$f":"U36/U37","v":5.0046246856871077E-2},{"$f":"IF(Input!$B$33=\"No\",\"\",V36/V37)","v":""},{"$f":"W36/W37","v":1},{"$f":"X36/X37","v":1},{"$f":"Y36/Y37","v":1},{"$f":"Z36/Z37","v":0.80888481273976698},{"$f":"AA36/AA37","v":0.39935748320886821},{"$f":"IF(Input!$B$33=\"No\",\"\",AB36/AB37)","v":""}]
[null,"Inverted",1,1,1,1,1,{"$f":"IF(Input!$B$33=\"No\",\"\",1)","v":""},1,1,1,1,1,{"$f":"IF(Input!$B$33=\"No\",\"\",1)","v":""}]
[]
["Bidding Factors for New Stripe-PCC: White Edge Line",null,null,null,null,null,null,null,null,null,null,null,null,null,null,"Bidding Factors for New Stripe-PCC: White Lane Line"]
["Reference Material","Material","Off-Peak Application",null,null,null,null,null,"Night Time Application",null,null,null,null,null,null,"Material","Off-Peak Application",null,null,null,null,null,"Night Time Application"]
[null,null,"ADT per Lane",null,null,null,null,"User ADT","ADT per Lane",null,null,null,null,"User ADT",null,null,"ADT per Lane",null,null,null,null,"User ADT","ADT per Lane",null,null,null,null,"User ADT"]
[null,null,5000,10000,15000,20000,25000,{"$f":"IF(Input!$B$33=\"No\",\"\",Input!$B$33)","v":""},5000,10000,15000,20000,25000,{"$f":"IF(Input!$B$33=\"No\",\"\",Input!$B$33)","v":""},null,null,5000,10000,15000,20000,25000,null,5000,10000,15000,20000,25000,{"$f":"IF(Input!$B$33=\"No\",\"\",Input!$B$33)","v":""}]
["40 mil","40 mil",1,1,1,1,1,{"$f":"IF(Input!$B$33=\"No\",\"\",1)","v":""},1,1,1,1,1,{"$f":"IF(Input!$B$33=\"No\",\"\",1)","v":""},null,"40 mil",{"$f":"IF(MIN(Results!E53,Results!E59)=Results!E53,1,'Factor Results'!AE142)","v":1},{"$f":"IF(MIN(Results!F53,Results!F59)=Results!F53,1,'Factor Results'!AF142)","v":1},{"$f":"IF(MIN(Results!G53,Results!G59)=Results!G53,1,'Factor Results'!AG142)","v":1},{"$f":"IF(MIN(Results!H53,Results!H59)=Results!H53,1,'Factor Results'!AH142)","v":1},{"$f":"IF(MIN(Results!I53,Results!I59)=Results!I53,1,'Factor Results'!AI142)","v":1},{"$f":"IF(MIN(Results!J53,Results!J59)=Results!J53,1,'Factor Results'!AJ142)","v":1},{"$f":"IF(MIN(Results!L53,Results!L59)=Results!L53,1,'Factor Results'!AU142)","v":1},{"$f":"IF(MIN(Results!M53,Results!M59)=Results!M53,1,'Factor Results'!AV142)","v":1},{"$f":"IF(MIN(Results!N53,Results!N59)=Results!N53,1,'Factor Results'!AW142)","v":1},{"$f":"IF(MIN(Results!O53,Results!O59)=Results!O53,1,'Factor Results'!AX142)","v":1},{"$f":"IF(MIN(Results!P53,Results!P59)=Results!P53,1,'Factor Results'!AY142)","v":1},{"$f":"IF(MIN(Results!Q53,Results!Q59)=Results!Q53,1,'Factor Results'!AZ142)","v":1}]
[null,"90 mil",{"$f":"Q48/Q47","v":1},{"$f":"R48/R47","v":1},{"$f":"S48/S47","v":1},{"$f":"T48/T47","v":1},{"$f":"U48/U47","v":1},{"$f":"IF(Input!$B$33=\"No\",\"\",V48/V47)","v":""},{"$f":"W48/W47","v":1},{"$f":"X48/X47","v":1},{"$f":"Y48/Y47","v":1},{"$f":"Z48/Z47","v":1},{"$f":"AA48/AA47","v":1},{"$f":"IF(Input!$B$33=\"No\",\"\",AB48/AB47)","v":""},null,"90 mil",{"$f":"IF(MIN(Results!E53,Results!E59)=Results!E53,'Factor Results'!AE124,1)","v":1},{"$f":"IF(MIN(Results!F53,Results!F59)=Results!F53,'Factor Results'!AF124,1)","v":1},{"$f":"IF(MIN(Results!G53,Results!G59)=Results!G53,'Factor Results'!AG124,1)","v":1},{"$f":"IF(MIN(Results!H53,Results!H59)=Results!H53,'Factor Results'!AH124,1)","v":1},{"$f":"IF(MIN(Results!I53,Results!I59)=Results!I53,'Factor Results'!AI124,1)","v":1},{"$f":"IF(MIN(Results!J53,Results!J59)=Results!J53,'Factor Results'!AJ124,1)","v":{"$error":"#VALUE!"}},{"$f":"IF(MIN(Results!L53,Results!L59)=Results!L53,'Factor Results'!AU124,1)","v":1},{"$f":"IF(MIN(Results!M53,Results!M59)=Results!M53,'Factor Results'!AV124,1)","v":1},{"$f":"IF(MIN(Results!N53,Results!N59)=Results!N53,'Factor Results'!AW124,1)","v":1},{"$f":"IF(MIN(Results!O53,Results!O59)=Results!O53,'Factor Results'!AX124,1)","v":1},{"$f":"IF(MIN(Results!P53,Results!P59)=Results!P53,'Factor Results'!AY124,1)","v":1},{"$f":"IF(MIN(Results!Q53,Results!Q59)=Results!Q53,'Factor Results'!AZ124,1)","v":{"$error":"#VALUE!"}}]
[null,"Tape",{"$f":"Q50/Q49","v":1},{"$f":"R50/R49","v":1},{"$f":"S50/S49","v":1},{"$f":"T50/T49","v":1},{"$f":"U50/U49","v":1},{"$f":"IF(Input!$B$33=\"No\",\"\",V50/V49)","v":""},{"$f":"W50/W49","v":1},{"$f":"X50/X49","v":1},{"$f":"Y50/Y49","v":1},{"$f":"Z50/Z49","v":1},{"$f":"AA50/AA49","v":1},{"$f":"IF(Input!$B$33=\"No\",\"\",AB50/AB49)","v":""},null,"40 mil",{"$f":"IF(MIN(Results!E53,Results!E65)=Results!E53,1,'Factor Results'!AE166)","v":1},{"$f":"IF(MIN(Results!F53,Results!F65)=Results!F53,1,'Factor Results'!AF166)","v":1},{"$f":"IF(MIN(Results!G53,Results!G65)=Results!G53,1,'Factor Results'!AG166)","v":1},{"$f":"IF(MIN(Results!H53,Results!H65)=Results!H53,1,'Factor Results'!AH166)","v":1},{"$f":"IF(MIN(Results!I53,Results!I65)=Results!I53,1,'Factor Results'!AI166)","v":1},{"$f":"IF(MIN(Results!J53,Results!J65)=Results!J53,1,'Factor Results'!AJ166)","v":1},{"$f":"IF(MIN(Results!L53,Results!L65)=Results!L53,1,'Factor Results'!AU166)","v":1},{"$f":"IF(MIN(Results!M53,Results!M65)=Results!M53,1,'Factor Results'!AV166)","v":1},{"$f":"IF(MIN(Results!N53,Results!N65)=Results!N53,1,'Factor Results'!AW166)","v":1},{"$f":"IF(MIN(Results!O53,Results!O65)=Results!O53,1,'Factor Results'!AX166)","v":1},{"$f":"IF(MIN(Results!P53,Results!P65)=Results!P53,1,'Factor Results'!AY166)","v":1},{"$f":"IF(MIN(Results!Q53,Results!Q65)=Results!Q53,1,'Factor Results'!AZ166)","v":1}]
[null,"Inverted",{"$f":"Q52/Q51","v":1},{"$f":"R52/R51","v":1},{"$f":"S52/S51","v":1},{"$f":"T52/T51","v":2.5994268172972332},{"$f":"U52/U51","v":39.417244776900098},{"$f":"IF(Input!$B$33=\"No\",\"\",V52/V51)","v":""},{"$f":"W52/W51","v":1},{"$f":"X52/X51","v":1},{"$f":"Y52/Y51","v":1},{"$f":"Z52/Z51","v":1.2402418371211648},{"$f":"AA52/AA51","v":2.6482209175318592},{"$f":"IF(Input!$B$33=\"No\",\"\",AB52/AB51)","v":""},null,"Tape",{"$f":"IF(MIN(Results!E53,Results!E65)=Results!E53,'Factor Results'!AE130,1)","v":1},{"$f":"IF(MIN(Results!F53,Results!F65)=Results!F53,'Factor Results'!AF130,1)","v":1},{"$f":"IF(MIN(Results!G53,Results!G65)=Results!G53,'Factor Results'!AG130,1)","v":1},{"$f":"IF(MIN(Results!H53,Results!H65)=Results!H53,'Factor Results'!AH130,1)","v":1},{"$f":"IF(MIN(Results!I53,Results!I65)=Results!I53,'Factor Results'!AI130,1)","v":1},{"$f":"IF(MIN(Results!J53,Results!J65)=Results!J53,'Factor Results'!AJ130,1)","v":{"$error":"#VALUE!"}},{"$f":"IF(MIN(Results!L53,Results!L65)=Results!L53,'Factor Results'!AU130,1)","v":1},{"$f":"IF(MIN(Results!M53,Results!M65)=Results!M53,'Factor Results'!AV130,1)","v":1},{"$f":"IF(MIN(Results!N53,Results!N65)=Results!N53,'Factor Results'!AW130,1)","v":1},{"$f":"IF(MIN(Results!O53,Results!O65)=Results!O53,'Factor Results'!AX130,1)","v":1},{"$f":"IF(MIN(Results!P53,Results!P65)=Results!P53,'Factor Results'!AY130,1)","v":1},{"$f":"IF(MIN(Results!Q53,Results!Q65)=Results!Q53,'Factor Results'!AZ130,1)","v":{"$error":"#VALUE!"}}]
["90 mil","40 mil",{"$f":"Q47/Q48","v":1},{"$f":"R47/R48","v":1},{"$f":"S47/S48","v":1},{"$f":"T47/T48","v":1},{"$f":"U47/U48","v":1},{"$f":"IF(Input!$B$33=\"No\",\"\",V47/V48)","v":""},{"$f":"W47/W48","v":1},{"$f":"X47/X48","v":1},{"$f":"Y47/Y48","v":1},{"$f":"Z47/Z48","v":1},{"$f":"AA47/AA48","v":1},{"$f":"IF(Input!$B$33=\"No\",\"\",AB47/AB48)","v":""},null,"40 mil",{"$f":"IF(MIN(Results!E53,Results!E71)=Results!E53,1,'Factor Results'!AE190)","v":1},{"$f":"IF(MIN(Results!F53,Results!F71)=Results!F53,1,'Factor Results'!AF190)","v":1},{"$f":"IF(MIN(Results!G53,Results!G71)=Results!G53,1,'Factor Results'!AG190)","v":1},{"$f":"IF(MIN(Results!H53,Results!H71)=Results!H53,1,'Factor Results'!AH190)","v":0.38470019365259722},{"$f":"IF(MIN(Results!I53,Results!I71)=Results!I53,1,'Factor Results'!AI190)","v":2.5369606771349869E-2},{"$f":"IF(MIN(Results!J53,Results!J71)=Results!J53,1,'Factor Results'!AJ190)","v":1},{"$f":"IF(MIN(Results!L53,Results!L71)=Results!L53,1,'Factor Results'!AU190)","v":1},{"$f":"IF(MIN(Results!M53,Results!M71)=Results!M53,1,'Factor Results'!AV190)","v":1},{"$f":"IF(MIN(Results!N53,Results!N71)=Results!N53,1,'Factor Results'!AW190)","v":1},{"$f":"IF(MIN(Results!O53,Results!O71)=Results!O53,1,'Factor Results'!AX190)","v":0.80629436136519039},{"$f":"IF(MIN(Results!P53,Results!P71)=Results!P53,1,'Factor Results'!AY190)","v":0.37761200109090581},{"$f":"IF(MIN(Results!Q53,Results!Q71)=Results!Q53,1,'Factor Results'!AZ190)","v":1}]
[null,"90 mil",1,1,1,1,1,{"$f":"IF(Input!$B$33=\"No\",\"\",1)","v":""},1,1,1,1,1,{"$f":"IF(Input!$B$33=\"No\",\"\",1)","v":""},null,"Inverted",{"$f":"IF(MIN(Results!E53,Results!E71)=Results!E53,'Factor Results'!AE136,1)","v":1},{"$f":"IF(MIN(Results!F53,Results!F71)=Results!F53,'Factor Results'!AF136,1)","v":1},{"$f":"IF(MIN(Results!G53,Results!G71)=Results!G53,'Factor Results'!AG136,1)","v":1},{"$f":"IF(MIN(Results!H53,Results!H71)=Results!H53,'Factor Results'!AH136,1)","v":1},{"$f":"IF(MIN(Results!I53,Results!I71)=Results!I53,'Factor Results'!AI136,1)","v":1},{"$f":"IF(MIN(Results!J53,Results!J71)=Results!J53,'Factor Results'!AJ136,1)","v":{"$error":"#VALUE!"}},{"$f":"IF(MIN(Results!L53,Results!L71)=Results!L53,'Factor Results'!AU136,1)","v":1},{"$f":"IF(MIN(Results!M53,Results!M71)=Results!M53,'Factor Results'!AV136,1)","v":1},{"$f":"IF(MIN(Results!N53,Results!N71)=Results!N53,'Factor Results'!AW136,1)","v":1},{"$f":"IF(MIN(Results!O53,Results!O71)=Results!O53,'Factor Results'!AX136,1)","v":1},{"$f":"IF(MIN(Results!P53,Results!P71)=Results!P53,'Factor Results'!AY136,1)","v":1},{"$f":"IF(MIN(Results!Q53,Results!Q71)=Results!Q53,'Factor Results'!AZ136,1)","v":{"$error":"#VALUE!"}}]
[null,"Tape",{"$f":"Q54/Q53","v":1},{"$f":"R54/R53","v":1},{"$f":"S54/S53","v":1},{"$f":"T54/T53","v":1},{"$f":"U54/U53","v":1},{"$f":"IF(Input!$B$33=\"No\",\"\",V54/V53)","v":""},{"$f":"W54/W53","v":1},{"$f":"X54/X53","v":1},{"$f":"Y54/Y53","v":1},{"$f":"Z54/Z53","v":1},{"$f":"AA54/AA53","v":1},{"$f":"IF(Input!$B$33=\"No\",\"\",AB54/AB53)","v":""},null,"90 mil",{"$f":"IF(MIN(Results!E59,Results!E65)=Results!E59,1,'Factor Results'!AE172)","v":1},{"$f":"IF(MIN(Results!F59,Results!F65)=Results!F59,1,'Factor Results'!AF172)","v":1},{"$f":"IF(MIN(Results!G59,Results!G65)=Results!G59,1,'Factor Results'!AG172)","v":1},{"$f":"IF(MIN(Results!H59,Results!H65)=Results!H59,1,'Factor Results'!AH172)","v":1},{"$f":"IF(MIN(Results!I59,Results!I65)=Results!I59,1,'Factor Results'!AI172)","v":1},{"$f":"IF(MIN(Results!J59,Results!J65)=Results!J59,1,'Factor Results'!AJ172)","v":1},{"$f":"IF(MIN(Results!L59,Results!L65)=Results!L59,1,'Factor Results'!AU172)","v":1},{"$f":"IF(MIN(Results!M59,Results!M65)=Results!M59,1,'Factor Results'!AV172)","v":1},{"$f":"IF(MIN(Results!N59,Results!N65)=Results!N59,1,'Factor Results'!AW172)","v":1},{"$f":"IF(MIN(Results!O59,Results!O65)=Results!O59,1,'Factor Results'!AX172)","v":1},{"$f":"IF(MIN(Results!P59,Results!P65)=Results!P59,1,'Factor Results'!AY172)","v":1},{"$f":"IF(MIN(Results!Q59,Results!Q65)=Results!Q59,1,'Factor Results'!AZ172)","v":1}]
[null,"Inverted",{"$f":"Q56/Q55","v":1},{"$f":"R56/R55","v":1},{"$f":"S56/S55","v":1},{"$f":"T56/T55","v":2.5994268172972332},{"$f":"U56/U55","v":39.417244776900098},{"$f":"IF(Input!$B$33=\"No\",\"\",V56/V55)","v":""},{"$f":"W56/W55","v":1},{"$f":"X56/X55","v":1},{"$f":"Y56/Y55","v":1},{"$f":"Z56/Z55","v":1.2402418371211648},{"$f":"AA56/AA55","v":2.6482209175318592},{"$f":"IF(Input!$B$33=\"No\",\"\",AB56/AB55)","v":""},null,"Tape",{"$f":"IF(MIN(Results!E59,Results!E65)=Results!E59,'Factor Results'!AE154,1)","v":1},{"$f":"IF(MIN(Results!F59,Results!F65)=Results!F59,'Factor Results'!AF154,1)","v":1},{"$f":"IF(MIN(Results!G59,Results!G65)=Results!G59,'Factor Results'!AG154,1)","v":1},{"$f":"IF(MIN(Results!H59,Results!H65)=Results!H59,'Factor Results'!AH154,1)","v":1},{"$f":"IF(MIN(Results!I59,Results!I65)=Results!I59,'Factor Results'!AI154,1)","v":1},{"$f":"IF(MIN(Results!J59,Results!J65)=Results!J59,'Factor Results'!AJ154,1)","v":{"$error":"#VALUE!"}},{"$f":"IF(MIN(Results!L59,Results!L65)=Results!L59,'Factor Results'!AU154,1)","v":1},{"$f":"IF(MIN(Results!M59,Results!M65)=Results!M59,'Factor Results'!AV154,1)","v":1},{"$f":"IF(MIN(Results!N59,Results!N65)=Results!N59,'Factor Results'!AW154,1)","v":1},{"$f":"IF(MIN(Results!O59,Results!O65)=Results!O59,'Factor Results'!AX154,1)","v":1},{"$f":"IF(MIN(Results!P59,Results!P65)=Results!P59,'Factor Results'!AY154,1)","v":1},{"$f":"IF(MIN(Results!Q59,Results!Q65)=Results!Q59,'Factor Results'!AZ154,1)","v":{"$error":"#VALUE!"}}]
["Tape","40 mil",{"$f":"Q49/Q50","v":1},{"$f":"R49/R50","v":1},{"$f":"S49/S50","v":1},{"$f":"T49/T50","v":1},{"$f":"U49/U50","v":1},{"$f":"IF(Input!$B$33=\"No\",\"\",V49/V50)","v":""},{"$f":"W49/W50","v":1},{"$f":"X49/X50","v":1},{"$f":"Y49/Y50","v":1},{"$f":"Z49/Z50","v":1},{"$f":"AA49/AA50","v":1},{"$f":"IF(Input!$B$33=\"No\",\"\",AB49/AB50)","v":""},null,"90 mil",{"$f":"IF(MIN(Results!E59,Results!E71)=Results!E59,1,'Factor Results'!AE196)","v":1},{"$f":"IF(MIN(Results!F59,Results!F71)=Results!F59,1,'Factor Results'!AF196)","v":1},{"$f":"IF(MIN(Results!G59,Results!G71)=Results!G59,1,'Factor Results'!AG196)","v":1},{"$f":"IF(MIN(Results!H59,Results!H71)=Results!H59,1,'Factor Results'!AH196)","v":0.38470019365259722},{"$f":"IF(MIN(Results!I59,Results!I71)=Results!I59,1,'Factor Results'!AI196)","v":2.5369606771349869E-2},{"$f":"IF(MIN(Results!J59,Results!J71)=Results!J59,1,'Factor Results'!AJ196)","v":1},{"$f":"IF(MIN(Results!L59,Results!L71)=Results!L59,1,'Factor Results'!AU196)","v":1},{"$f":"IF(MIN(Results!M59,Results!M71)=Results!M59,1,'Factor Results'!AV196)","v":1},{"$f":"IF(MIN(Results!N59,Results!N71)=Results!N59,1,'Factor Results'!AW196)","v":1},{"$f":"IF(MIN(Results!O59,Results!O71)=Results!O59,1,'Factor Results'!AX196)","v":0.80629436136519039},{"$f":"IF(MIN(Results!P59,Results!P71)=Results!P59,1,'Factor Results'!AY196)","v":0.37761200109090581},{"$f":"IF(MIN(Results!Q59,Results!Q71)=Results!Q59,1,'Factor Results'!AZ196)","v":1}]
[null,"90 mil",{"$f":"Q53/Q54","v":1},{"$f":"R53/R54","v":1},{"$f":"S53/S54","v":1},{"$f":"T53/T54","v":1},{"$f":"U53/U54","v":1},{"$f":"IF(Input!$B$33=\"No\",\"\",V53/V54)","v":""},{"$f":"W53/W54","v":1},{"$f":"X53/X54","v":1},{"$f":"Y53/Y54","v":1},{"$f":"Z53/Z54","v":1},{"$f":"AA53/AA54","v":1},{"$f":"IF(Input!$B$33=\"No\",\"\",AB53/AB54)","v":""},null,"Inverted",{"$f":"IF(MIN(Results!E59,Results!E71)=Results!E59,'Factor Results'!AE160,1)","v":1},{"$f":"IF(MIN(Results!F59,Results!F71)=Results!F59,'Factor Results'!AF160,1)","v":1},{"$f":"IF(MIN(Results!G59,Results!G71)=Results!G59,'Factor Results'!AG160,1)","v":1},{"$f":"IF(MIN(Results!H59,Results!H71)=Results!H59,'Factor Results'!AH160,1)","v":1},{"$f":"IF(MIN(Results!I59,Results!I71)=Results!I59,'Factor Results'!AI160,1)","v":1},{"$f":"IF(MIN(Results!J59,Results!J71)=Results!J59,'Factor Results'!AJ160,1)","v":{"$error":"#VALUE!"}},{"$f":"IF(MIN(Results!L59,Results!L71)=Results!L59,'Factor Results'!AU160,1)","v":1},{"$f":"IF(MIN(Results!M59,Results!M71)=Results!M59,'Factor Results'!AV160,1)","v":1},{"$f":"IF(MIN(Results!N59,Results!N71)=Results!N59,'Factor Results'!AW160,1)","v":1},{"$f":"IF(MIN(Results!O59,Results!O71)=Results!O59,'Factor Results'!AX160,1)","v":1},{"$f":"IF(MIN(Results!P59,Results!P71)=Results!P59,'Factor Results'!AY160,1)","v":1},{"$f":"IF(MIN(Results!Q59,Results!Q71)=Results!Q59,'Factor Results'!AZ160,1)","v":{"$error":"#VALUE!"}}]
[null,"Tape",1,1,1,1,1,{"$f":"IF(Input!$B$33=\"No\",\"\",1)","v":""},1,1,1,1,1,{"$f":"IF(Input!$B$33=\"No\",\"\",1)","v":""},null,"Tape",{"$f":"IF(MIN(Results!E65,Results!E71)=Results!E65,1,'Factor Results'!AE202)","v":1},{"$f":"IF(MIN(Results!F65,Results!F71)=Results!F65,1,'Factor Results'!AF202)","v":1},{"$f":"IF(MIN(Results!G65,Results!G71)=Results!G65,1,'Factor Results'!AG202)","v":1},{"$f":"IF(MIN(Results!H65,Results!H71)=Results!H65,1,'Factor Results'!AH202)","v":0.38470019365259722},{"$f":"IF(MIN(Results!I65,Results!I71)=Results!I65,1,'Factor Results'!AI202)","v":2.5369606771349869E-2},{"$f":"IF(MIN(Results!J65,Results!J71)=Results!J65,1,'Factor Results'!AJ202)","v":1},{"$f":"IF(MIN(Results!L65,Results!L71)=Results!L65,1,'Factor Results'!AU202)","v":1},{"$f":"IF(MIN(Results!M65,Results!M71)=Results!M65,1,'Factor Results'!AV202)","v":1},{"$f":"IF(MIN(Results!N65,Results!N71)=Results!N65,1,'Factor Results'!AW202)","v":1},{"$f":"IF(MIN(Results!O65,Results!O71)=Results!O65,1,'Factor Results'!AX202)","v":1},{"$f":"IF(MIN(Results!P65,Results!P71)=Results!P65,1,'Factor Results'!AY202)","v":0.37761200109090581},{"$f":"IF(MIN(Results!Q65,Results!Q71)=Results!Q65,1,'Factor Results'!AZ202)","v":1}]
[null,"Inverted",{"$f":"Q58/Q57","v":1},{"$f":"R58/R57","v":1},{"$f":"S58/S57","v":1},{"$f":"T58/T57","v":2.5994268172972332},{"$f":"U58/U57","v":39.417244776900098},{"$f":"IF(Input!$B$33=\"No\",\"\",V58/V57)","v":""},{"$f":"W58/W57","v":1},{"$f":"X58/X57","v":1},{"$f":"Y58/Y57","v":1},{"$f":"Z58/Z57","v":1.2389812584179167},{"$f":"AA58/AA57","v":2.6482209175318592},{"$f":"IF(Input!$B$33=\"No\",\"\",AB58/AB57)","v":""},null,"Inverted",{"$f":"IF(MIN(Results!E65,Results!E71)=Results!E65,'Factor Results'!AE184,1)","v":1},{"$f":"IF(MIN(Results!F65,Results!F71)=Results!F65,'Factor Results'!AF184,1)","v":1},{"$f":"IF(MIN(Results!G65,Results!G71)=Results!G65,'Factor Results'!AG184,1)","v":1},{"$f":"IF(MIN(Results!H65,Results!H71)=Results!H65,'Factor Results'!AH184,1)","v":1},{"$f":"IF(MIN(Results!I65,Results!I71)=Results!I65,'Factor Results'!AI184,1)","v":1},{"$f":"IF(MIN(Results!J65,Results!J71)=Results!J65,'Factor Results'!AJ184,1)","v":{"$error":"#VALUE!"}},{"$f":"IF(MIN(Results!L65,Results!L71)=Results!L65,'Factor Results'!AU184,1)","v":1},{"$f":"IF(MIN(Results!M65,Results!M71)=Results!M65,'Factor Results'!AV184,1)","v":1},{"$f":"IF(MIN(Results!N65,Results!N71)=Results!N65,'Factor Results'!AW184,1)","v":1},{"$f":"IF(MIN(Results!O65,Results!O71)=Results!O65,'Factor Results'!AX184,1)","v":1.2389812584179167},{"$f":"IF(MIN(Results!P65,Results!P71)=Results!P65,'Factor Results'!AY184,1)","v":1},{"$f":"IF(MIN(Results!Q65,Results!Q71)=Results!Q65,'Factor Results'!AZ184,1)","v":{"$error":"#VALUE!"}}]
["Inverted","40 mil",{"$f":"Q51/Q52","v":1},{"$f":"R51/R52","v":1},{"$f":"S51/S52","v":1},{"$f":"T51/T52","v":0.38470019365259722},{"$f":"U51/U52","v":2.5369606771349869E-2},{"$f":"IF(Input!$B$33=\"No\",\"\",V51/V52)","v":""},{"$f":"W51/W52","v":1},{"$f":"X51/X52","v":1},{"$f":"Y51/Y52","v":1},{"$f":"Z51/Z52","v":0.80629436136519039},{"$f":"AA51/AA52","v":0.37761200109090581},{"$f":"IF(Input!$B$33=\"No\",\"\",AB51/AB52)","v":""}]
[null,"90 mil",{"$f":"Q55/Q56","v":1},{"$f":"R55/R56","v":1},{"$f":"S55/S56","v":1},{"$f":"T55/T56","v":0.38470019365259722},{"$f":"U55/U56","v":2.5369606771349869E-2},{"$f":"IF(Input!$B$33=\"No\",\"\",V55/V56)","v":""},{"$f":"W55/W56","v":1},{"$f":"X55/X56","v":1},{"$f":"Y55/Y56","v":1},{"$f":"Z55/Z56","v":0.80629436136519039},{"$f":"AA55/AA56","v":0.37761200109090581},{"$f":"IF(Input!$B$33=\"No\",\"\",AB55/AB56)","v":""}]
[null,"Tape",{"$f":"Q57/Q58","v":1},{"$f":"R57/R58","v":1},{"$f":"S57/S58","v":1},{"$f":"T57/T58","v":0.38470019365259722},{"$f":"U57/U58","v":2.5369606771349869E-2},{"$f":"IF(Input!$B$33=\"No\",\"\",V57/V58)","v":""},{"$f":"W57/W58","v":1},{"$f":"X57/X58","v":1},{"$f":"Y57/Y58","v":1},{"$f":"Z57/Z58","v":0.80711471073979169},{"$f":"AA57/AA58","v":0.37761200109090581},{"$f":"IF(Input!$B$33=\"No\",\"\",AB57/AB58)","v":""}]
[null,"Inverted",1,1,1,1,1,{"$f":"IF(Input!$B$33=\"No\",\"\",1)","v":""},1,1,1,1,1,{"$f":"IF(Input!$B$33=\"No\",\"\",1)","v":""}]
[]
[null,null,null,null,null,null,null,"Number of lanes in one direction=",{"$f":"Input!B26","v":"2"}]

{"sheet":"Factors for Restripe-AC","index":14,"n_rows":64,"n_cols":28,"rows_kept":64,"cut":false,"hidden":true,"merged":[[4,0,7,0],[8,0,11,0],[12,0,15,0],[25,0,28,0],[29,0,32,0],[16,0,19,0],[2,8,2,12],[2,16,2,20],[2,22,2,26],[0,15,0,27],[1,0,3,0],[1,1,3,1],[1,2,1,7],[1,8,1,13],[1,15,3,15],[1,16,1,21],[1,22,1,27],[2,2,2,6],[14,15,14,27],[22,0,24,0],[22,1,24,1],[22,2,22,7],[22,8,22,13],[15,15,17,15],[15,16,15,21],[15,22,15,27],[23,2,23,6],[23,8,23,12],[33,0,36,0],[37,0,40,0],[42,0,42,13],[16,16,16,20],[16,22,16,26],[21,0,21,13],[46,0,49,0],[50,0,53,0],[54,0,57,0],[58,0,61,0],[28,15,28,27],[43,0,45,0],[43,1,45,1],[43,2,43,7],[43,8,43,13],[29,15,31,15],[29,16,29,21],[29,22,29,27],[44,2,44,6],[44,8,44,12],[30,16,30,20],[30,22,30,26]]}
["Equivalent Cost Factors for Restripe-AC",null,null,null,"Yellow Edge Line",null,null,null,null,null,null,null,null,null,null,"Bidding Factors for Restripe-AC: Yellow Edge Line"]
["Reference Material","Material","Off-Peak Application",null,null,null,null,null,"Night Time Application",null,null,null,null,null,null,"Material","Off-Peak Application",null,null,null,null,null,"Night Time Application"]
[null,null,"ADT per Lane",null,null,null,null,"User ADT","ADT per Lane",null,null,null,null,"User ADT",null,null,"ADT per Lane",null,null,null,null,"User ADT","ADT per Lane",null,null,null,null,"User ADT"]
[null,null,5000,10000,15000,20000,25000,{"$f":"IF(Input!$B$33=\"No\",\"\",Input!$B$33)","v":""},5000,10000,15000,20000,25000,{"$f":"IF(Input!$B$33=\"No\",\"\",Input!$B$33)","v":""},null,null,5000,10000,15000,20000,25000,null,5000,10000,15000,20000,25000,{"$f":"IF(Input!$B$33=\"No\",\"\",Input!$B$33)","v":""}]
["40 mil","40 mil",1,1,1,1,1,{"$f":"IF(Input!$B$33=\"No\",\"\",1)","v":""},1,1,1,1,1,{"$f":"IF(Input!$B$33=\"No\",\"\",1)","v":""},null,"40 mil",{"$f":"IF(MIN(Results!E9,Results!E15)=Results!E9,1,'Factor Results'!AE33)","v":1},{"$f":"IF(MIN(Results!F9,Results!F15)=Results!F9,1,'Factor Results'!AF33)","v":1.1310858227081071},{"$f":"IF(MIN(Results!G9,Results!G15)=Results!G9,1,'Factor Results'!AG33)","v":1},{"$f":"IF(MIN(Results!H9,Results!H15)=Results!H9,1,'Factor Results'!AH33)","v":1},{"$f":"IF(MIN(Results!I9,Results!I15)=Results!I9,1,'Factor Results'!AI33)","v":1},{"$f":"IF(MIN(Results!J9,Results!J15)=Results!J9,1,'Factor Results'!AJ33)","v":1},{"$f":"IF(MIN(Results!L9,Results!L15)=Results!L9,1,'Factor Results'!AU33)","v":1},{"$f":"IF(MIN(Results!M9,Results!M15)=Results!M9,1,'Factor Results'!AV33)","v":1.1289060044423203},{"$f":"IF(MIN(Results!N9,Results!N15)=Results!N9,1,'Factor Results'!AW33)","v":1},{"$f":"IF(MIN(Results!O9,Results!O15)=Results!O9,1,'Factor Results'!AX33)","v":1},{"$f":"IF(MIN(Results!P9,Results!P15)=Results!P9,1,'Factor Results'!AY33)","v":1},{"$f":"IF(MIN(Results!Q9,Results!Q15)=Results!Q9,1,'Factor Results'!AZ33)","v":1}]
[null,"90 mil",{"$f":"Q6/Q5","v":1},{"$f":"R6/R5","v":0.88410621008912105},0.45595686849630079,0.10753366270836925,5.5945259316757655E-3,{"$f":"IF(Input!$B$33=\"No\",\"\",V6/V5)","v":""},{"$f":"W6/W5","v":1},{"$f":"X6/X5","v":0.88581334146946999},0.55555230973592507,0.2839017408445671,5.7663486595376338E-2,{"$f":"IF(Input!$B$33=\"No\",\"\",AB6/AB5)","v":""},null,"90 mil",{"$f":"IF(MIN(Results!E9,Results!E15)=Results!E9,'Factor Results'!AE15,1)","v":1},{"$f":"IF(MIN(Results!F9,Results!F15)=Results!F9,'Factor Results'!AF15,1)","v":1},{"$f":"IF(MIN(Results!G9,Results!G15)=Results!G9,'Factor Results'!AG15,1)","v":0.45595686849630079},{"$f":"IF(MIN(Results!H9,Results!H15)=Results!H9,'Factor Results'!AH15,1)","v":0.10753366270836925},{"$f":"IF(MIN(Results!I9,Results!I15)=Results!I9,'Factor Results'!AI15,1)","v":5.5945259316757655E-3},{"$f":"IF(MIN(Results!J9,Results!J15)=Results!J9,'Factor Results'!AJ15,1)","v":{"$error":"#VALUE!"}},{"$f":"IF(MIN(Results!L9,Results!L15)=Results!L9,'Factor Results'!AU15,1)","v":1},{"$f":"IF(MIN(Results!M9,Results!M15)=Results!M9,'Factor Results'!AV15,1)","v":1},{"$f":"IF(MIN(Results!N9,Results!N15)=Results!N9,'Factor Results'!AW15,1)","v":0.55555230973592507},{"$f":"IF(MIN(Results!O9,Results!O15)=Results!O9,'Factor Results'!AX15,1)","v":0.2839017408445671},{"$f":"IF(MIN(Results!P9,Results!P15)=Results!P9,'Factor Results'!AY15,1)","v":5.7663486595376338E-2},{"$f":"IF(MIN(Results!Q9,Results!Q15)=Results!Q9,'Factor Results'!AZ15,1)","v":{"$error":"#VALUE!"}}]
[null,"Tape",{"$f":"Q8/Q7","v":1},{"$f":"R8/R7","v":0.88504457631191835},0.45595686849630079,0.10753366270836925,5.5945259316757655E-3,{"$f":"IF(Input!$B$33=\"No\",\"\",V8/V7)","v":""},{"$f":"W8/W7","v":1},{"$f":"X8/X7","v":0.88602964658289685},0.55586092126464814,0.2839017408445671,5.7663486595376338E-2,{"$f":"IF(Input!$B$33=\"No\",\"\",AB8/AB7)","v":""},null,"40 mil",{"$f":"IF(MIN(Results!E9,Results!E21)=Results!E9,1,'Factor Results'!AE57)","v":1},{"$f":"IF(MIN(Results!F9,Results!F21)=Results!F9,1,'Factor Results'!AF57)","v":1.1298865918902232},{"$f":"IF(MIN(Results!G9,Results!G21)=Results!G9,1,'Factor Results'!AG57)","v":1},{"$f":"IF(MIN(Results!H9,Results!H21)=Results!H9,1,'Factor Results'!AH57)","v":1},{"$f":"IF(MIN(Results!I9,Results!I21)=Results!I9,1,'Factor Results'!AI57)","v":1},{"$f":"IF(MIN(Results!J9,Results!J21)=Results!J9,1,'Factor Results'!AJ57)","v":1},{"$f":"IF(MIN(Results!L9,Results!L21)=Results!L9,1,'Factor Results'!AU57)","v":1},{"$f":"IF(MIN(Results!M9,Results!M21)=Results!M9,1,'Factor Results'!AV57)","v":1.1286304062811516},{"$f":"IF(MIN(Results!N9,Results!N21)=Results!N9,1,'Factor Results'!AW57)","v":1.7990111586273845},{"$f":"IF(MIN(Results!O9,Results!O21)=Results!O9,1,'Factor Results'!AX57)","v":1},{"$f":"IF(MIN(Results!P9,Results!P21)=Results!P9,1,'Factor Results'!AY57)","v":1},{"$f":"IF(MIN(Results!Q9,Results!Q21)=Results!Q9,1,'Factor Results'!AZ57)","v":1}]
[null,"Inverted","N/A","N/A","N/A","N/A","N/A","N/A","N/A","N/A","N/A","N/A","N/A","N/A",null,"Tape",{"$f":"IF(MIN(Results!E9,Results!E21)=Results!E9,'Factor Results'!AE21,1)","v":1},{"$f":"IF(MIN(Results!F9,Results!F21)=Results!F9,'Factor Results'!AF21,1)","v":1},{"$f":"IF(MIN(Results!G9,Results!G21)=Results!G9,'Factor Results'!AG21,1)","v":0.45595686849630079},{"$f":"IF(MIN(Results!H9,Results!H21)=Results!H9,'Factor Results'!AH21,1)","v":0.10753366270836925},{"$f":"IF(MIN(Results!I9,Results!I21)=Results!I9,'Factor Results'!AI21,1)","v":5.5945259316757655E-3},{"$f":"IF(MIN(Results!J9,Results!J21)=Results!J9,'Factor Results'!AJ21,1)","v":{"$error":"#VALUE!"}},{"$f":"IF(MIN(Results!L9,Results!L21)=Results!L9,'Factor Results'!AU21,1)","v":1},{"$f":"IF(MIN(Results!M9,Results!M21)=Results!M9,'Factor Results'!AV21,1)","v":1},{"$f":"IF(MIN(Results!N9,Results!N21)=Results!N9,'Factor Results'!AW21,1)","v":1},{"$f":"IF(MIN(Results!O9,Results!O21)=Results!O9,'Factor Results'!AX21,1)","v":0.2839017408445671},{"$f":"IF(MIN(Results!P9,Results!P21)=Results!P9,'Factor Results'!AY21,1)","v":5.7663486595376338E-2},{"$f":"IF(MIN(Results!Q9,Results!Q21)=Results!Q9,'Factor Results'!AZ21,1)","v":{"$error":"#VALUE!"}}]
["90 mil","40 mil",{"$f":"Q5/Q6","v":1},{"$f":"R5/R6","v":1.1310858227081071},{"$f":"S5/S6","v":2.1931899025842028},{"$f":"T5/T6","v":9.2994135493365917},{"$f":"U5/U6","v":178.74615511889553},{"$f":"IF(Input!$B$33=\"No\",\"\",V5/V6)","v":""},{"$f":"W5/W6","v":1},{"$f":"X5/X6","v":1.1289060044423203},{"$f":"Y5/Y6","v":1.8000105165170452},{"$f":"Z5/Z6","v":3.5223454319975036},{"$f":"AA5/AA6","v":17.341996799759652},{"$f":"IF(Input!$B$33=\"No\",\"\",AB5/AB6)","v":""},null,"90 mil",{"$f":"IF(MIN(Results!E15,Results!E21)=Results!E15,1,'Factor Results'!AE63)","v":1},{"$f":"IF(MIN(Results!F15,Results!F21)=Results!F15,1,'Factor Results'!AF63)","v":1},{"$f":"IF(MIN(Results!G15,Results!G21)=Results!G15,1,'Factor Results'!AG63)","v":1},{"$f":"IF(MIN(Results!H15,Results!H21)=Results!H15,1,'Factor Results'!AH63)","v":1},{"$f":"IF(MIN(Results!I15,Results!I21)=Results!I15,1,'Factor Results'!AI63)","v":1},{"$f":"IF(MIN(Results!J15,Results!J21)=Results!J15,1,'Factor Results'!AJ63)","v":1},{"$f":"IF(MIN(Results!L15,Results!L21)=Results!L15,1,'Factor Results'!AU63)","v":1},{"$f":"IF(MIN(Results!M15,Results!M21)=Results!M15,1,'Factor Results'!AV63)","v":1},{"$f":"IF(MIN(Results!N15,Results!N21)=Results!N15,1,'Factor Results'!AW63)","v":1},{"$f":"IF(MIN(Results!O15,Results!O21)=Results!O15,1,'Factor Results'!AX63)","v":1},{"$f":"IF(MIN(Results!P15,Results!P21)=Results!P15,1,'Factor Results'!AY63)","v":1},{"$f":"IF(MIN(Results!Q15,Results!Q21)=Results!Q15,1,'Factor Results'!AZ63)","v":1}]
[null,"90 mil",1,1,1,1,1,{"$f":"IF(Input!$B$33=\"No\",\"\",1)","v":""},1,1,1,1,1,{"$f":"IF(Input!$B$33=\"No\",\"\",1)","v":""},null,"Tape",{"$f":"IF(MIN(Results!E15,Results!E21)=Results!E15,'Factor Results'!AE45,1)","v":1},{"$f":"IF(MIN(Results!F15,Results!F21)=Results!F15,'Factor Results'!AF45,1)","v":1},{"$f":"IF(MIN(Results!G15,Results!G21)=Results!G15,'Factor Results'!AG45,1)","v":1},{"$f":"IF(MIN(Results!H15,Results!H21)=Results!H15,'Factor Results'!AH45,1)","v":1},{"$f":"IF(MIN(Results!I15,Results!I21)=Results!I15,'Factor Results'!AI45,1)","v":1},{"$f":"IF(MIN(Results!J15,Results!J21)=Results!J15,'Factor Results'!AJ45,1)","v":{"$error":"#VALUE!"}},{"$f":"IF(MIN(Results!L15,Results!L21)=Results!L15,'Factor Results'!AU45,1)","v":1},{"$f":"IF(MIN(Results!M15,Results!M21)=Results!M15,'Factor Results'!AV45,1)","v":1},{"$f":"IF(MIN(Results!N15,Results!N21)=Results!N15,'Factor Results'!AW45,1)","v":1},{"$f":"IF(MIN(Results!O15,Results!O21)=Results!O15,'Factor Results'!AX45,1)","v":1},{"$f":"IF(MIN(Results!P15,Results!P21)=Results!P15,'Factor Results'!AY45,1)","v":1},{"$f":"IF(MIN(Results!Q15,Results!Q21)=Results!Q15,'Factor Results'!AZ45,1)","v":{"$error":"#VALUE!"}}]
[null,"Tape",{"$f":"Q10/Q9","v":1},{"$f":"R10/R9","v":1},1,1,1,{"$f":"IF(Input!$B$33=\"No\",\"\",V10/V9)","v":""},{"$f":"W10/W9","v":1},{"$f":"X10/X9","v":1},1,1,1,{"$f":"IF(Input!$B$33=\"No\",\"\",AB10/AB9)","v":""}]
[null,"Inverted","N/A","N/A","N/A","N/A","N/A","N/A","N/A","N/A","N/A","N/A","N/A","N/A"]
["Tape","40 mil",{"$f":"Q7/Q8","v":1},{"$f":"R7/R8","v":1.1298865918902232},{"$f":"S7/S8","v":2.1931899025842028},{"$f":"T7/T8","v":9.2994135493365917},{"$f":"U7/U8","v":178.74615511889553},{"$f":"IF(Input!$B$33=\"No\",\"\",V7/V8)","v":""},{"$f":"W7/W8","v":1},{"$f":"X7/X8","v":1.1286304062811516},{"$f":"Y7/Y8","v":1.7990111586273845},{"$f":"Z7/Z8","v":3.5223454319975036},{"$f":"AA7/AA8","v":17.341996799759652},{"$f":"IF(Input!$B$33=\"No\",\"\",AB7/AB8)","v":""}]
[null,"90 mil",{"$f":"Q9/Q10","v":1},{"$f":"R9/R10","v":1},{"$f":"S9/S10","v":1},{"$f":"T9/T10","v":1},{"$f":"U9/U10","v":1},{"$f":"IF(Input!$B$33=\"No\",\"\",V9/V10)","v":""},{"$f":"W9/W10","v":1},{"$f":"X9/X10","v":1},{"$f":"Y9/Y10","v":1},{"$f":"Z9/Z10","v":1},{"$f":"AA9/AA10","v":1},{"$f":"IF(Input!$B$33=\"No\",\"\",AB9/AB10)","v":""}]
[null,"Tape",1,1,1,1,1,{"$f":"IF(Input!$B$33=\"No\",\"\",1)","v":""},1,1,1,1,1,{"$f":"IF(Input!$B$33=\"No\",\"\",1)","v":""},null,"Bidding Factors for Restripe-AC: White Edge Line"]
[null,"Inverted","N/A","N/A","N/A","N/A","N/A","N/A","N/A","N/A","N/A","N/A","N/A","N/A",null,"Material","Off-Peak Application",null,null,null,null,null,"Night Time Application"]
["Inverted","40 mil","N/A","N/A","N/A","N/A","N/A","N/A","N/A","N/A","N/A","N/A","N/A","N/A",null,null,"ADT per Lane",null,null,null,null,"User ADT","ADT per Lane",null,null,null,null,"User ADT"]
[null,"90 mil","N/A","N/A","N/A","N/A","N/A","N/A","N/A","N/A","N/A","N/A","N/A","N/A",null,null,5000,10000,15000,20000,25000,null,5000,10000,15000,20000,25000,{"$f":"IF(Input!$B$33=\"No\",\"\",Input!$B$33)","v":""}]
[null,"Tape","N/A","N/A","N/A","N/A","N/A","N/A","N/A","N/A","N/A","N/A","N/A","N/A",null,"40 mil",{"$f":"IF(MIN(Results!E10,Results!E16)=Results!E10,1,'Factor Results'!AE34)","v":1},{"$f":"IF(MIN(Results!F10,Results!F16)=Results!F10,1,'Factor Results'!AF34)","v":1},{"$f":"IF(MIN(Results!G10,Results!G16)=Results!G10,1,'Factor Results'!AG34)","v":1},{"$f":"IF(MIN(Results!H10,Results!H16)=Results!H10,1,'Factor Results'!AH34)","v":1.105527179679642},{"$f":"IF(MIN(Results!I10,Results!I16)=Results!I10,1,'Factor Results'!AI34)","v":1},{"$f":"IF(MIN(Results!J10,Results!J16)=Results!J10,1,'Factor Results'!AJ34)","v":1},{"$f":"IF(MIN(Results!L10,Results!L16)=Results!L10,1,'Factor Results'!AU34)","v":1},{"$f":"IF(MIN(Results!M10,Results!M16)=Results!M10,1,'Factor Results'!AV34)","v":1},{"$f":"IF(MIN(Results!N10,Results!N16)=Results!N10,1,'Factor Results'!AW34)","v":1},{"$f":"IF(MIN(Results!O10,Results!O16)=Results!O10,1,'Factor Results'!AX34)","v":1.0343732170599789},{"$f":"IF(MIN(Results!P10,Results!P16)=Results!P10,1,'Factor Results'!AY34)","v":1},{"$f":"IF(MIN(Results!Q10,Results!Q16)=Results!Q10,1,'Factor Results'!AZ34)","v":1}]
[null,"Inverted","N/A","N/A","N/A","N/A","N/A","N/A","N/A","N/A","N/A","N/A","N/A","N/A",null,"90 mil",{"$f":"IF(MIN(Results!E10,Results!E16)=Results!E10,'Factor Results'!AE16,1)","v":1},{"$f":"IF(MIN(Results!F10,Results!F16)=Results!F10,'Factor Results'!AF16,1)","v":1},{"$f":"IF(MIN(Results!G10,Results!G16)=Results!G10,'Factor Results'!AG16,1)","v":1},{"$f":"IF(MIN(Results!H10,Results!H16)=Results!H10,'Factor Results'!AH16,1)","v":1},{"$f":"IF(MIN(Results!I10,Results!I16)=Results!I10,'Factor Results'!AI16,1)","v":0.12846456909699536},{"$f":"IF(MIN(Results!J10,Results!J16)=Results!J10,'Factor Results'!AJ16,1)","v":{"$error":"#VALUE!"}},{"$f":"IF(MIN(Results!L10,Results!L16)=Results!L10,'Factor Results'!AU16,1)","v":1},{"$f":"IF(MIN(Results!M10,Results!M16)=Results!M10,'Factor Results'!AV16,1)","v":1},{"$f":"IF(MIN(Results!N10,Results!N16)=Results!N10,'Factor Results'!AW16,1)","v":1},{"$f":"IF(MIN(Results!O10,Results!O16)=Results!O10,'Factor Results'!AX16,1)","v":1},{"$f":"IF(MIN(Results!P10,Results!P16)=Results!P10,'Factor Results'!AY16,1)","v":0.6158605150765728},{"$f":"IF(MIN(Results!Q10,Results!Q16)=Results!Q10,'Factor Results'!AZ16,1)","v":{"$error":"#VALUE!"}}]
[null,null,null,null,null,null,null,null,null,null,null,null,null,null,null,"40 mil",{"$f":"IF(MIN(Results!E10,Results!E22)=Results!E10,1,'Factor Results'!AE58)","v":1},{"$f":"IF(MIN(Results!F10,Results!F22)=Results!F10,1,'Factor Results'!AF58)","v":1},{"$f":"IF(MIN(Results!G10,Results!G22)=Results!G10,1,'Factor Results'!AG58)","v":1},{"$f":"IF(MIN(Results!H10,Results!H22)=Results!H10,1,'Factor Results'!AH58)","v":1.0741269357917684},{"$f":"IF(MIN(Results!I10,Results!I22)=Results!I10,1,'Factor Results'!AI58)","v":1},{"$f":"IF(MIN(Results!J10,Results!J22)=Results!J10,1,'Factor Results'!AJ58)","v":1},{"$f":"IF(MIN(Results!L10,Results!L22)=Results!L10,1,'Factor Results'!AU58)","v":1},{"$f":"IF(MIN(Results!M10,Results!M22)=Results!M10,1,'Factor Results'!AV58)","v":1},{"$f":"IF(MIN(Results!N10,Results!N22)=Results!N10,1,'Factor Results'!AW58)","v":1},{"$f":"IF(MIN(Results!O10,Results!O22)=Results!O10,1,'Factor Results'!AX58)","v":1.034240094549278},{"$f":"IF(MIN(Results!P10,Results!P22)=Results!P10,1,'Factor Results'!AY58)","v":1.6126580471048042},{"$f":"IF(MIN(Results!Q10,Results!Q22)=Results!Q10,1,'Factor Results'!AZ58)","v":1}]
["Bidding Factors for Restripe-AC: White Edge Line",null,null,null,null,null,null,null,null,null,null,null,null,null,null,"Tape",{"$f":"IF(MIN(Results!E10,Results!E22)=Results!E10,'Factor Results'!AE22,1)","v":1},{"$f":"IF(MIN(Results!F10,Results!F22)=Results!F10,'Factor Results'!AF22,1)","v":1},{"$f":"IF(MIN(Results!G10,Results!G22)=Results!G10,'Factor Results'!AG22,1)","v":1},{"$f":"IF(MIN(Results!H10,Results!H22)=Results!H10,'Factor Results'!AH22,1)","v":1},{"$f":"IF(MIN(Results!I10,Results!I22)=Results!I10,'Factor Results'!AI22,1)","v":0.12846456909699536},{"$f":"IF(MIN(Results!J10,Results!J22)=Results!J10,'Factor Results'!AJ22,1)","v":{"$error":"#VALUE!"}},{"$f":"IF(MIN(Results!L10,Results!L22)=Results!L10,'Factor Results'!AU22,1)","v":1},{"$f":"IF(MIN(Results!M10,Results!M22)=Results!M10,'Factor Results'!AV22,1)","v":1},{"$f":"IF(MIN(Results!N10,Results!N22)=Results!N10,'Factor Results'!AW22,1)","v":1},{"$f":"IF(MIN(Results!O10,Results!O22)=Results!O10,'Factor Results'!AX22,1)","v":1},{"$f":"IF(MIN(Results!P10,Results!P22)=Results!P10,'Factor Results'!AY22,1)","v":1},{"$f":"IF(MIN(Results!Q10,Results!Q22)=Results!Q10,'Factor Results'!AZ22,1)","v":{"$error":"#VALUE!"}}]
["Reference Material","Material","Off-Peak Application",null,null,null,null,null,"Night Time Application",null,null,null,null,null,null,"90 mil",{"$f":"IF(MIN(Results!E16,Results!E22)=Results!E16,1,'Factor Results'!AE64)","v":1},{"$f":"IF(MIN(Results!F16,Results!F22)=Results!F16,1,'Factor Results'!AF64)","v":1},{"$f":"IF(MIN(Results!G16,Results!G22)=Results!G16,1,'Factor Results'!AG64)","v":1},{"$f":"IF(MIN(Results!H16,Results!H22)=Results!H16,1,'Factor Results'!AH64)","v":1},{"$f":"IF(MIN(Results!I16,Results!I22)=Results!I16,1,'Factor Results'!AI64)","v":1},{"$f":"IF(MIN(Results!J16,Results!J22)=Results!J16,1,'Factor Results'!AJ64)","v":1},{"$f":"IF(MIN(Results!L16,Results!L22)=Results!L16,1,'Factor Results'!AU64)","v":1},{"$f":"IF(MIN(Results!M16,Results!M22)=Results!M16,1,'Factor Results'!AV64)","v":1},{"$f":"IF(MIN(Results!N16,Results!N22)=Results!N16,1,'Factor Results'!AW64)","v":1},{"$f":"IF(MIN(Results!O16,Results!O22)=Results!O16,1,'Factor Results'!AX64)","v":1},{"$f":"IF(MIN(Results!P16,Results!P22)=Results!P16,1,'Factor Results'!AY64)","v":1},{"$f":"IF(MIN(Results!Q16,Results!Q22)=Results!Q16,1,'Factor Results'!AZ64)","v":1}]
[null,null,"ADT per Lane",null,null,null,null,"User ADT","ADT per Lane",null,null,null,null,"User ADT",null,"Tape",{"$f":"IF(MIN(Results!E16,Results!E22)=Results!E16,'Factor Results'!AE46,1)","v":1},{"$f":"IF(MIN(Results!F16,Results!F22)=Results!F16,'Factor Results'!AF46,1)","v":1},{"$f":"IF(MIN(Results!G16,Results!G22)=Results!G16,'Factor Results'!AG46,1)","v":1},{"$f":"IF(MIN(Results!H16,Results!H22)=Results!H16,'Factor Results'!AH46,1)","v":1},{"$f":"IF(MIN(Results!I16,Results!I22)=Results!I16,'Factor Results'!AI46,1)","v":1},{"$f":"IF(MIN(Results!J16,Results!J22)=Results!J16,'Factor Results'!AJ46,1)","v":{"$error":"#VALUE!"}},{"$f":"IF(MIN(Results!L16,Results!L22)=Results!L16,'Factor Results'!AU46,1)","v":1},{"$f":"IF(MIN(Results!M16,Results!M22)=Results!M16,'Factor Results'!AV46,1)","v":1},{"$f":"IF(MIN(Results!N16,Results!N22)=Results!N16,'Factor Results'!AW46,1)","v":1},{"$f":"IF(MIN(Results!O16,Results!O22)=Results!O16,'Factor Results'!AX46,1)","v":1},{"$f":"IF(MIN(Results!P16,Results!P22)=Results!P16,'Factor Results'!AY46,1)","v":1},{"$f":"IF(MIN(Results!Q16,Results!Q22)=Results!Q16,'Factor Results'!AZ46,1)","v":{"$error":"#VALUE!"}}]
[null,null,5000,10000,15000,20000,25000,{"$f":"IF(Input!$B$33=\"No\",\"\",Input!$B$33)","v":""},5000,10000,15000,20000,25000,{"$f":"IF(Input!$B$33=\"No\",\"\",Input!$B$33)","v":""}]
["40 mil","40 mil",1,1,1,1,1,{"$f":"IF(Input!$B$33=\"No\",\"\",1)","v":""},1,1,1,1,1,{"$f":"IF(Input!$B$33=\"No\",\"\",1)","v":""}]
[null,"90 mil",{"$f":"Q20/Q19","v":1},{"$f":"R20/R19","v":1},1,0.90454582970070307,0.12846456909699536,{"$f":"IF(Input!$B$33=\"No\",\"\",V20/V19)","v":""},{"$f":"W20/W19","v":1},{"$f":"X20/X19","v":1},1,0.9667690380096281,0.6158605150765728,{"$f":"IF(Input!$B$33=\"No\",\"\",AB20/AB19)","v":""}]
[null,"Tape",{"$f":"Q22/Q21","v":1},{"$f":"R22/R21","v":1},1,0.93098866314424245,0.12846456909699536,{"$f":"IF(Input!$B$33=\"No\",\"\",V22/V21)","v":""},{"$f":"W22/W21","v":1},{"$f":"X22/X21","v":1},1,0.96689347596391551,0.62009426102160614,{"$f":"IF(Input!$B$33=\"No\",\"\",AB22/AB21)","v":""}]
[null,"Inverted","N/A","N/A","N/A","N/A","N/A","N/A","N/A","N/A","N/A","N/A","N/A","N/A",null,"Bidding Factors for Restripe-AC: White Lane Line"]
["90 mil","40 mil",{"$f":"Q19/Q20","v":1},{"$f":"R19/R20","v":1},{"$f":"S19/S20","v":1},{"$f":"T19/T20","v":1.105527179679642},{"$f":"U19/U20","v":7.7842474935245694},{"$f":"IF(Input!$B$33=\"No\",\"\",V19/V20)","v":""},{"$f":"W19/W20","v":1},{"$f":"X19/X20","v":1},{"$f":"Y19/Y20","v":1},{"$f":"Z19/Z20","v":1.0343732170599789},{"$f":"AA19/AA20","v":1.6237442984563888},{"$f":"IF(Input!$B$33=\"No\",\"\",AB19/AB20)","v":""},null,"Material","Off-Peak Application",null,null,null,null,null,"Night Time Application"]
[null,"90 mil",1,1,1,1,1,{"$f":"IF(Input!$B$33=\"No\",\"\",1)","v":""},1,1,1,1,1,{"$f":"IF(Input!$B$33=\"No\",\"\",1)","v":""},null,null,"ADT per Lane",null,null,null,null,"User ADT","ADT per Lane",null,null,null,null,"User ADT"]
[null,"Tape",{"$f":"Q24/Q23","v":1},{"$f":"R24/R23","v":1},1,1,1,{"$f":"IF(Input!$B$33=\"No\",\"\",V24/V23)","v":""},{"$f":"W24/W23","v":1},{"$f":"X24/X23","v":1},1,1,1,{"$f":"IF(Input!$B$33=\"No\",\"\",AB24/AB23)","v":""},null,null,5000,10000,15000,20000,25000,null,5000,10000,15000,20000,25000,{"$f":"IF(Input!$B$33=\"No\",\"\",Input!$B$33)","v":""}]
[null,"Inverted","N/A","N/A","N/A","N/A","N/A","N/A","N/A","N/A","N/A","N/A","N/A","N/A",null,"40 mil",{"$f":"IF(MIN(Results!E11,Results!E17)=Results!E11,1,'Factor Results'!AE35)","v":1},{"$f":"IF(MIN(Results!F11,Results!F17)=Results!F11,1,'Factor Results'!AF35)","v":1},{"$f":"IF(MIN(Results!G11,Results!G17)=Results!G11,1,'Factor Results'!AG35)","v":1},{"$f":"IF(MIN(Results!H11,Results!H17)=Results!H11,1,'Factor Results'!AH35)","v":1},{"$f":"IF(MIN(Results!I11,Results!I17)=Results!I11,1,'Factor Results'!AI35)","v":1},{"$f":"IF(MIN(Results!J11,Results!J17)=Results!J11,1,'Factor Results'!AJ35)","v":1},{"$f":"IF(MIN(Results!L11,Results!L17)=Results!L11,1,'Factor Results'!AU35)","v":1},{"$f":"IF(MIN(Results!M11,Results!M17)=Results!M11,1,'Factor Results'!AV35)","v":1},{"$f":"IF(MIN(Results!N11,Results!N17)=Results!N11,1,'Factor Results'!AW35)","v":1},{"$f":"IF(MIN(Results!O11,Results!O17)=Results!O11,1,'Factor Results'!AX35)","v":1.0344583643289107},{"$f":"IF(MIN(Results!P11,Results!P17)=Results!P11,1,'Factor Results'!AY35)","v":1},{"$f":"IF(MIN(Results!Q11,Results!Q17)=Results!Q11,1,'Factor Results'!AZ35)","v":1}]
["Tape","40 mil",{"$f":"Q21/Q22","v":1},{"$f":"R21/R22","v":1},{"$f":"S21/S22","v":1},{"$f":"T21/T22","v":1.0741269357917684},{"$f":"U21/U22","v":7.7842474935245694},{"$f":"IF(Input!$B$33=\"No\",\"\",V21/V22)","v":""},{"$f":"W21/W22","v":1},{"$f":"X21/X22","v":1},{"$f":"Y21/Y22","v":1},{"$f":"Z21/Z22","v":1.034240094549278},{"$f":"AA21/AA22","v":1.6126580471048042},{"$f":"IF(Input!$B$33=\"No\",\"\",AB21/AB22)","v":""},null,"90 mil",{"$f":"IF(MIN(Results!E11,Results!E17)=Results!E11,'Factor Results'!AE17,1)","v":1},{"$f":"IF(MIN(Results!F11,Results!F17)=Results!F11,'Factor Results'!AF17,1)","v":1},{"$f":"IF(MIN(Results!G11,Results!G17)=Results!G11,'Factor Results'!AG17,1)","v":1},{"$f":"IF(MIN(Results!H11,Results!H17)=Results!H11,'Factor Results'!AH17,1)","v":0.89095327621796228},{"$f":"IF(MIN(Results!I11,Results!I17)=Results!I11,'Factor Results'!AI17,1)","v":0.11768562925434416},{"$f":"IF(MIN(Results!J11,Results!J17)=Results!J11,'Factor Results'!AJ17,1)","v":{"$error":"#VALUE!"}},{"$f":"IF(MIN(Results!L11,Results!L17)=Results!L11,'Factor Results'!AU17,1)","v":1},{"$f":"IF(MIN(Results!M11,Results!M17)=Results!M11,'Factor Results'!AV17,1)","v":1},{"$f":"IF(MIN(Results!N11,Results!N17)=Results!N11,'Factor Results'!AW17,1)","v":1},{"$f":"IF(MIN(Results!O11,Results!O17)=Results!O11,'Factor Results'!AX17,1)","v":1},{"$f":"IF(MIN(Results!P11,Results!P17)=Results!P11,'Factor Results'!AY17,1)","v":0.6138607355652782},{"$f":"IF(MIN(Results!Q11,Results!Q17)=Results!Q11,'Factor Results'!AZ17,1)","v":{"$error":"#VALUE!"}}]
[null,"90 mil",{"$f":"Q23/Q24","v":1},{"$f":"R23/R24","v":1},{"$f":"S23/S24","v":1},{"$f":"T23/T24","v":1},{"$f":"U23/U24","v":1},{"$f":"IF(Input!$B$33=\"No\",\"\",V23/V24)","v":""},{"$f":"W23/W24","v":1},{"$f":"X23/X24","v":1},{"$f":"Y23/Y24","v":1},{"$f":"Z23/Z24","v":1},{"$f":"AA23/AA24","v":1},{"$f":"IF(Input!$B$33=\"No\",\"\",AB23/AB24)","v":""},null,"40 mil",{"$f":"IF(MIN(Results!E11,Results!E23)=Results!E11,1,'Factor Results'!AE59)","v":1},{"$f":"IF(MIN(Results!F11,Results!F23)=Results!F11,1,'Factor Results'!AF59)","v":1},{"$f":"IF(MIN(Results!G11,Results!G23)=Results!G11,1,'Factor Results'!AG59)","v":1},{"$f":"IF(MIN(Results!H11,Results!H23)=Results!H11,1,'Factor Results'!AH59)","v":1.0938850159446407},{"$f":"IF(MIN(Results!I11,Results!I23)=Results!I11,1,'Factor Results'!AI59)","v":1},{"$f":"IF(MIN(Results!J11,Results!J23)=Results!J11,1,'Factor Results'!AJ59)","v":1},{"$f":"IF(MIN(Results!L11,Results!L23)=Results!L11,1,'Factor Results'!AU59)","v":1},{"$f":"IF(MIN(Results!M11,Results!M23)=Results!M11,1,'Factor Results'!AV59)","v":1},{"$f":"IF(MIN(Results!N11,Results!N23)=Results!N11,1,'Factor Results'!AW59)","v":1},{"$f":"IF(MIN(Results!O11,Results!O23)=Results!O11,1,'Factor Results'!AX59)","v":1.0343247472116042},{"$f":"IF(MIN(Results!P11,Results!P23)=Results!P11,1,'Factor Results'!AY59)","v":1},{"$f":"IF(MIN(Results!Q11,Results!Q23)=Results!Q11,1,'Factor Results'!AZ59)","v":1}]
[null,"Tape",1,1,1,1,1,{"$f":"IF(Input!$B$33=\"No\",\"\",1)","v":""},1,1,1,1,1,{"$f":"IF(Input!$B$33=\"No\",\"\",1)","v":""},null,"Tape",{"$f":"IF(MIN(Results!E11,Results!E23)=Results!E11,'Factor Results'!AE23,1)","v":1},{"$f":"IF(MIN(Results!F11,Results!F23)=Results!F11,'Factor Results'!AF23,1)","v":1},{"$f":"IF(MIN(Results!G11,Results!G23)=Results!G11,'Factor Results'!AG23,1)","v":1},{"$f":"IF(MIN(Results!H11,Results!H23)=Results!H11,'Factor Results'!AH23,1)","v":1},{"$f":"IF(MIN(Results!I11,Results!I23)=Results!I11,'Factor Results'!AI23,1)","v":0.11768562925434416},{"$f":"IF(MIN(Results!J11,Results!J23)=Results!J11,'Factor Results'!AJ23,1)","v":{"$error":"#VALUE!"}},{"$f":"IF(MIN(Results!L11,Results!L23)=Results!L11,'Factor Results'!AU23,1)","v":1},{"$f":"IF(MIN(Results!M11,Results!M23)=Results!M11,'Factor Results'!AV23,1)","v":1},{"$f":"IF(MIN(Results!N11,Results!N23)=Results!N11,'Factor Results'!AW23,1)","v":1},{"$f":"IF(MIN(Results!O11,Results!O23)=Results!O11,'Factor Results'!AX23,1)","v":1},{"$f":"IF(MIN(Results!P11,Results!P23)=Results!P11,'Factor Results'!AY23,1)","v":0.6138607355652782},{"$f":"IF(MIN(Results!Q11,Results!Q23)=Results!Q11,'Factor Results'!AZ23,1)","v":{"$error":"#VALUE!"}}]
[null,"Inverted","N/A","N/A","N/A","N/A","N/A","N/A","N/A","N/A","N/A","N/A","N/A","N/A",null,"90 mil",{"$f":"IF(MIN(Results!E17,Results!E23)=Results!E17,1,'Factor Results'!AE65)","v":1},{"$f":"IF(MIN(Results!F17,Results!F23)=Results!F17,1,'Factor Results'!AF65)","v":1},{"$f":"IF(MIN(Results!G17,Results!G23)=Results!G17,1,'Factor Results'!AG65)","v":1},{"$f":"IF(MIN(Results!H17,Results!H23)=Results!H17,1,'Factor Results'!AH65)","v":1},{"$f":"IF(MIN(Results!I17,Results!I23)=Results!I17,1,'Factor Results'!AI65)","v":1},{"$f":"IF(MIN(Results!J17,Results!J23)=Results!J17,1,'Factor Results'!AJ65)","v":1},{"$f":"IF(MIN(Results!L17,Results!L23)=Results!L17,1,'Factor Results'!AU65)","v":1},{"$f":"IF(MIN(Results!M17,Results!M23)=Results!M17,1,'Factor Results'!AV65)","v":1},{"$f":"IF(MIN(Results!N17,Results!N23)=Results!N17,1,'Factor Results'!AW65)","v":1},{"$f":"IF(MIN(Results!O17,Results!O23)=Results!O17,1,'Factor Results'!AX65)","v":1},{"$f":"IF(MIN(Results!P17,Results!P23)=Results!P17,1,'Factor Results'!AY65)","v":1},{"$f":"IF(MIN(Results!Q17,Results!Q23)=Results!Q17,1,'Factor Results'!AZ65)","v":1}]
["Inverted","40 mil","N/A","N/A","N/A","N/A","N/A","N/A","N/A","N/A","N/A","N/A","N/A","N/A",null,"Tape",{"$f":"IF(MIN(Results!E17,Results!E23)=Results!E17,'Factor Results'!AE47,1)","v":1},{"$f":"IF(MIN(Results!F17,Results!F23)=Results!F17,'Factor Results'!AF47,1)","v":1},{"$f":"IF(MIN(Results!G17,Results!G23)=Results!G17,'Factor Results'!AG47,1)","v":1},{"$f":"IF(MIN(Results!H17,Results!H23)=Results!H17,'Factor Results'!AH47,1)","v":1},{"$f":"IF(MIN(Results!I17,Results!I23)=Results!I17,'Factor Results'!AI47,1)","v":1},{"$f":"IF(MIN(Results!J17,Results!J23)=Results!J17,'Factor Results'!AJ47,1)","v":{"$error":"#VALUE!"}},{"$f":"IF(MIN(Results!L17,Results!L23)=Results!L17,'Factor Results'!AU47,1)","v":1},{"$f":"IF(MIN(Results!M17,Results!M23)=Results!M17,'Factor Results'!AV47,1)","v":1},{"$f":"IF(MIN(Results!N17,Results!N23)=Results!N17,'Factor Results'!AW47,1)","v":1},{"$f":"IF(MIN(Results!O17,Results!O23)=Results!O17,'Factor Results'!AX47,1)","v":1},{"$f":"IF(MIN(Results!P17,Results!P23)=Results!P17,'Factor Results'!AY47,1)","v":1},{"$f":"IF(MIN(Results!Q17,Results!Q23)=Results!Q17,'Factor Results'!AZ47,1)","v":{"$error":"#VALUE!"}}]
[null,"90 mil","N/A","N/A","N/A","N/A","N/A","N/A","N/A","N/A","N/A","N/A","N/A","N/A"]
[null,"Tape","N/A","N/A","N/A","N/A","N/A","N/A","N/A","N/A","N/A","N/A","N/A","N/A"]
[null,"Inverted","N/A","N/A","N/A","N/A","N/A","N/A","N/A","N/A","N/A","N/A","N/A","N/A"]
[]
["Bidding Factors for Restripe-AC: White Edge Line"]
["Reference Material","Material","Off-Peak Application",null,null,null,null,null,"Night Time Application"]
[null,null,"ADT per Lane",null,null,null,null,"User ADT","ADT per Lane",null,null,null,null,"User ADT"]
[null,null,5000,10000,15000,20000,25000,{"$f":"IF(Input!$B$33=\"No\",\"\",Input!$B$33)","v":""},5000,10000,15000,20000,25000,{"$f":"IF(Input!$B$33=\"No\",\"\",Input!$B$33)","v":""}]
["40 mil","40 mil",1,1,1,1,1,{"$f":"IF(Input!$B$33=\"No\",\"\",1)","v":""},1,1,1,1,1,{"$f":"IF(Input!$B$33=\"No\",\"\",1)","v":""}]
[null,"90 mil",{"$f":"Q34/Q33","v":1},{"$f":"R34/R33","v":1},1,0.89095327621796228,0.11768562925434416,{"$f":"IF(Input!$B$33=\"No\",\"\",V34/V33)","v":""},{"$f":"W34/W33","v":1},{"$f":"X34/X33","v":1},1,0.96668946231464326,0.6138607355652782,{"$f":"IF(Input!$B$33=\"No\",\"\",AB34/AB33)","v":""}]
[null,"Tape",{"$f":"Q36/Q35","v":1},{"$f":"R36/R35","v":1},1,0.91417286590806357,0.11768562925434416,{"$f":"IF(Input!$B$33=\"No\",\"\",V36/V35)","v":""},{"$f":"W36/W35","v":1},{"$f":"X36/X35","v":1},1,0.9668143421066363,0.6138607355652782,{"$f":"IF(Input!$B$33=\"No\",\"\",AB36/AB35)","v":""}]
[null,"Inverted","N/A","N/A","N/A","N/A","N/A","N/A","N/A","N/A","N/A","N/A","N/A","N/A"]
["90 mil","40 mil",{"$f":"Q33/Q34","v":1},{"$f":"R33/R34","v":1},{"$f":"S33/S34","v":1},{"$f":"T33/T34","v":1.1223933136482014},{"$f":"U33/U34","v":8.4972141996945378},{"$f":"IF(Input!$B$33=\"No\",\"\",V33/V34)","v":""},{"$f":"W33/W34","v":1},{"$f":"X33/X34","v":1},{"$f":"Y33/Y34","v":1},{"$f":"Z33/Z34","v":1.0344583643289107},{"$f":"AA33/AA34","v":1.6290339845227966},{"$f":"IF(Input!$B$33=\"No\",\"\",AB33/AB34)","v":""}]
[null,"90 mil",1,1,1,1,1,{"$f":"IF(Input!$B$33=\"No\",\"\",1)","v":""},1,1,1,1,1,{"$f":"IF(Input!$B$33=\"No\",\"\",1)","v":""}]
[null,"Tape",{"$f":"Q38/Q37","v":1},{"$f":"R38/R37","v":1},1,1,1,{"$f":"IF(Input!$B$33=\"No\",\"\",V38/V37)","v":""},{"$f":"W38/W37","v":1},{"$f":"X38/X37","v":1},1,1,1,{"$f":"IF(Input!$B$33=\"No\",\"\",AB38/AB37)","v":""}]
[null,"Inverted","N/A","N/A","N/A","N/A","N/A","N/A","N/A","N/A","N/A","N/A","N/A","N/A"]
["Tape","40 mil",{"$f":"Q35/Q36","v":1},{"$f":"R35/R36","v":1},{"$f":"S35/S36","v":1},{"$f":"T35/T36","v":1.0938850159446407},{"$f":"U35/U36","v":8.4972141996945378},{"$f":"IF(Input!$B$33=\"No\",\"\",V35/V36)","v":""},{"$f":"W35/W36","v":1},{"$f":"X35/X36","v":1},{"$f":"Y35/Y36","v":1},{"$f":"Z35/Z36","v":1.0343247472116042},{"$f":"AA35/AA36","v":1.6290339845227966},{"$f":"IF(Input!$B$33=\"No\",\"\",AB35/AB36)","v":""}]
[null,"90 mil",{"$f":"Q37/Q38","v":1},{"$f":"R37/R38","v":1},{"$f":"S37/S38","v":1},{"$f":"T37/T38","v":1},{"$f":"U37/U38","v":1},{"$f":"IF(Input!$B$33=\"No\",\"\",V37/V38)","v":""},{"$f":"W37/W38","v":1},{"$f":"X37/X38","v":1},{"$f":"Y37/Y38","v":1},{"$f":"Z37/Z38","v":1},{"$f":"AA37/AA38","v":1},{"$f":"IF(Input!$B$33=\"No\",\"\",AB37/AB38)","v":""}]
[null,"Tape",1,1,1,1,1,{"$f":"IF(Input!$B$33=\"No\",\"\",1)","v":""},1,1,1,1,1,{"$f":"IF(Input!$B$33=\"No\",\"\",1)","v":""}]
[null,"Inverted","N/A","N/A","N/A","N/A","N/A","N/A","N/A","N/A","N/A","N/A","N/A","N/A"]
["Inverted","40 mil","N/A","N/A","N/A","N/A","N/A","N/A","N/A","N/A","N/A","N/A","N/A","N/A"]
[null,"90 mil","N/A","N/A","N/A","N/A","N/A","N/A","N/A","N/A","N/A","N/A","N/A","N/A"]
[null,"Tape","N/A","N/A","N/A","N/A","N/A","N/A","N/A","N/A","N/A","N/A","N/A","N/A"]
[null,"Inverted","N/A","N/A","N/A","N/A","N/A","N/A","N/A","N/A","N/A","N/A","N/A","N/A"]
[]
[null,null,null,null,null,null,null,"Number of lanes in one direction=",{"$f":"Input!B26","v":"2"}]

{"sheet":"Factors for New Stripe-AC","index":15,"n_rows":64,"n_cols":28,"rows_kept":64,"cut":false,"hidden":true,"merged":[[58,0,61,0],[46,0,49,0],[50,0,53,0],[54,0,57,0],[16,0,19,0],[42,0,42,13],[4,0,7,0],[8,0,11,0],[12,0,15,0],[37,0,40,0],[25,0,28,0],[29,0,32,0],[33,0,36,0],[21,0,21,13],[0,15,0,27],[1,0,3,0],[1,1,3,1],[1,2,1,7],[1,8,1,13],[1,15,3,15],[1,16,1,21],[1,22,1,27],[2,2,2,6],[2,8,2,12],[2,16,2,20],[2,22,2,26],[14,15,14,27],[22,0,24,0],[22,1,24,1],[22,2,22,7],[22,8,22,13],[15,15,17,15],[15,16,15,21],[15,22,15,27],[23,2,23,6],[23,8,23,12],[16,16,16,20],[16,22,16,26],[28,15,28,27],[43,0,45,0],[43,1,45,1],[43,2,43,7],[43,8,43,13],[29,15,31,15],[29,16,29,21],[29,22,29,27],[44,2,44,6],[44,8,44,12],[30,16,30,20],[30,22,30,26]]}
["Equivalent Cost Factors for New Stripe-AC",null,null,null,"Yellow Edge Line",null,null,null,null,null,null,null,null,null,null,"Bidding Factors for New Stripe-AC: Yellow Edge Line"]
["Reference Material","Material","Off-Peak Application",null,null,null,null,null,"Night Time Application",null,null,null,null,null,null,"Material","Off-Peak Application",null,null,null,null,null,"Night Time Application"]
[null,null,"ADT per Lane",null,null,null,null,"User ADT","ADT per Lane",null,null,null,null,"User ADT",null,null,"ADT per Lane",null,null,null,null,"User ADT","ADT per Lane",null,null,null,null,"User ADT"]
[null,null,5000,10000,15000,20000,25000,{"$f":"IF(Input!$B$33=\"No\",\"\",Input!$B$33)","v":""},5000,10000,15000,20000,25000,{"$f":"IF(Input!$B$33=\"No\",\"\",Input!$B$33)","v":""},null,null,5000,10000,15000,20000,25000,null,5000,10000,15000,20000,25000,{"$f":"IF(Input!$B$33=\"No\",\"\",Input!$B$33)","v":""}]
["40 mil","40 mil",1,1,1,1,1,{"$f":"IF(Input!$B$33=\"No\",\"\",1)","v":""},1,1,1,1,1,{"$f":"IF(Input!$B$33=\"No\",\"\",1)","v":""},null,"40 mil",{"$f":"IF(MIN(Results!E54,Results!E60)=Results!E54,1,'Factor Results'!AE143)","v":1},{"$f":"IF(MIN(Results!F54,Results!F60)=Results!F54,1,'Factor Results'!AF143)","v":1.1371807402914276},{"$f":"IF(MIN(Results!G54,Results!G60)=Results!G54,1,'Factor Results'!AG143)","v":1},{"$f":"IF(MIN(Results!H54,Results!H60)=Results!H54,1,'Factor Results'!AH143)","v":1},{"$f":"IF(MIN(Results!I54,Results!I60)=Results!I54,1,'Factor Results'!AI143)","v":1},{"$f":"IF(MIN(Results!J54,Results!J60)=Results!J54,1,'Factor Results'!AJ143)","v":1},{"$f":"IF(MIN(Results!L54,Results!L60)=Results!L54,1,'Factor Results'!AU143)","v":1},{"$f":"IF(MIN(Results!M54,Results!M60)=Results!M54,1,'Factor Results'!AV143)","v":1.1302997664540155},{"$f":"IF(MIN(Results!N54,Results!N60)=Results!N54,1,'Factor Results'!AW143)","v":1.8239579455698627},{"$f":"IF(MIN(Results!O54,Results!O60)=Results!O54,1,'Factor Results'!AX143)","v":1},{"$f":"IF(MIN(Results!P54,Results!P60)=Results!P54,1,'Factor Results'!AY143)","v":1},{"$f":"IF(MIN(Results!Q54,Results!Q60)=Results!Q54,1,'Factor Results'!AZ143)","v":1}]
[null,"90 mil",{"$f":"Q6/Q5","v":1},{"$f":"R6/R5","v":0.87936768938218912},0.237366153869566,2.588756348769413E-2,9.9959308988704899E-4,{"$f":"IF(Input!$B$33=\"No\",\"\",V6/V5)","v":""},{"$f":"W6/W5","v":1},{"$f":"X6/X5","v":0.88472105336906082},0.54825825476341672,0.2731967029833462,4.2665549651508199E-2,{"$f":"IF(Input!$B$33=\"No\",\"\",AB6/AB5)","v":""},null,"90 mil",{"$f":"IF(MIN(Results!E54,Results!E60)=Results!E54,'Factor Results'!AE125,1)","v":1},{"$f":"IF(MIN(Results!F54,Results!F60)=Results!F54,'Factor Results'!AF125,1)","v":1},{"$f":"IF(MIN(Results!G54,Results!G60)=Results!G54,'Factor Results'!AG125,1)","v":0.237366153869566},{"$f":"IF(MIN(Results!H54,Results!H60)=Results!H54,'Factor Results'!AH125,1)","v":2.588756348769413E-2},{"$f":"IF(MIN(Results!I54,Results!I60)=Results!I54,'Factor Results'!AI125,1)","v":9.9959308988704899E-4},{"$f":"IF(MIN(Results!J54,Results!J60)=Results!J54,'Factor Results'!AJ125,1)","v":{"$error":"#VALUE!"}},{"$f":"IF(MIN(Results!L54,Results!L60)=Results!L54,'Factor Results'!AU125,1)","v":1},{"$f":"IF(MIN(Results!M54,Results!M60)=Results!M54,'Factor Results'!AV125,1)","v":1},{"$f":"IF(MIN(Results!N54,Results!N60)=Results!N54,'Factor Results'!AW125,1)","v":1},{"$f":"IF(MIN(Results!O54,Results!O60)=Results!O54,'Factor Results'!AX125,1)","v":0.2731967029833462},{"$f":"IF(MIN(Results!P54,Results!P60)=Results!P54,'Factor Results'!AY125,1)","v":4.2665549651508199E-2},{"$f":"IF(MIN(Results!Q54,Results!Q60)=Results!Q54,'Factor Results'!AZ125,1)","v":{"$error":"#VALUE!"}}]
[null,"Tape",{"$f":"Q8/Q7","v":1},{"$f":"R8/R7","v":0.88421565904157384},0.38470647470024066,2.588756348769413E-2,9.9959308988704899E-4,{"$f":"IF(Input!$B$33=\"No\",\"\",V8/V7)","v":""},{"$f":"W8/W7","v":1},{"$f":"X8/X7","v":0.88583857081756412},0.55475080904265939,0.28005851367630175,4.2665549651508199E-2,{"$f":"IF(Input!$B$33=\"No\",\"\",AB8/AB7)","v":""},null,"40 mil",{"$f":"IF(MIN(Results!E54,Results!E66)=Results!E54,1,'Factor Results'!AE167)","v":1},{"$f":"IF(MIN(Results!F54,Results!F66)=Results!F54,1,'Factor Results'!AF167)","v":1.1309458159606991},{"$f":"IF(MIN(Results!G54,Results!G66)=Results!G54,1,'Factor Results'!AG167)","v":2.5993843768270075},{"$f":"IF(MIN(Results!H54,Results!H66)=Results!H54,1,'Factor Results'!AH167)","v":1},{"$f":"IF(MIN(Results!I54,Results!I66)=Results!I54,1,'Factor Results'!AI167)","v":1},{"$f":"IF(MIN(Results!J54,Results!J66)=Results!J54,1,'Factor Results'!AJ167)","v":1},{"$f":"IF(MIN(Results!L54,Results!L66)=Results!L54,1,'Factor Results'!AU167)","v":1},{"$f":"IF(MIN(Results!M54,Results!M66)=Results!M54,1,'Factor Results'!AV167)","v":1.1288738523510815},{"$f":"IF(MIN(Results!N54,Results!N66)=Results!N54,1,'Factor Results'!AW167)","v":1.8026111610827802},{"$f":"IF(MIN(Results!O54,Results!O66)=Results!O54,1,'Factor Results'!AX167)","v":3.5706823794538298},{"$f":"IF(MIN(Results!P54,Results!P66)=Results!P54,1,'Factor Results'!AY167)","v":1},{"$f":"IF(MIN(Results!Q54,Results!Q66)=Results!Q54,1,'Factor Results'!AZ167)","v":1}]
[null,"Inverted","N/A","N/A","N/A","N/A","N/A","N/A","N/A","N/A","N/A","N/A","N/A","N/A",null,"Tape",{"$f":"IF(MIN(Results!E54,Results!E66)=Results!E54,'Factor Results'!AE131,1)","v":1},{"$f":"IF(MIN(Results!F54,Results!F66)=Results!F54,'Factor Results'!AF131,1)","v":1},{"$f":"IF(MIN(Results!G54,Results!G66)=Results!G54,'Factor Results'!AG131,1)","v":1},{"$f":"IF(MIN(Results!H54,Results!H66)=Results!H54,'Factor Results'!AH131,1)","v":2.588756348769413E-2},{"$f":"IF(MIN(Results!I54,Results!I66)=Results!I54,'Factor Results'!AI131,1)","v":9.9959308988704899E-4},{"$f":"IF(MIN(Results!J54,Results!J66)=Results!J54,'Factor Results'!AJ131,1)","v":{"$error":"#VALUE!"}},{"$f":"IF(MIN(Results!L54,Results!L66)=Results!L54,'Factor Results'!AU131,1)","v":1},{"$f":"IF(MIN(Results!M54,Results!M66)=Results!M54,'Factor Results'!AV131,1)","v":1},{"$f":"IF(MIN(Results!N54,Results!N66)=Results!N54,'Factor Results'!AW131,1)","v":1},{"$f":"IF(MIN(Results!O54,Results!O66)=Results!O54,'Factor Results'!AX131,1)","v":1},{"$f":"IF(MIN(Results!P54,Results!P66)=Results!P54,'Factor Results'!AY131,1)","v":4.2665549651508199E-2},{"$f":"IF(MIN(Results!Q54,Results!Q66)=Results!Q54,'Factor Results'!AZ131,1)","v":{"$error":"#VALUE!"}}]
["90 mil","40 mil",{"$f":"Q5/Q6","v":1},{"$f":"R5/R6","v":1.1371807402914276},{"$f":"S5/S6","v":4.2129005492059557},{"$f":"T5/T6","v":38.628587061712409},{"$f":"U5/U6","v":1000.407075756193},{"$f":"IF(Input!$B$33=\"No\",\"\",V5/V6)","v":""},{"$f":"W5/W6","v":1},{"$f":"X5/X6","v":1.1302997664540155},{"$f":"Y5/Y6","v":1.8239579455698627},{"$f":"Z5/Z6","v":3.660366282169075},{"$f":"AA5/AA6","v":23.438113610816934},{"$f":"IF(Input!$B$33=\"No\",\"\",AB5/AB6)","v":""},null,"90 mil",{"$f":"IF(MIN(Results!E60,Results!E66)=Results!E60,1,'Factor Results'!AE173)","v":1},{"$f":"IF(MIN(Results!F60,Results!F66)=Results!F60,1,'Factor Results'!AF173)","v":1},{"$f":"IF(MIN(Results!G60,Results!G66)=Results!G60,1,'Factor Results'!AG173)","v":1},{"$f":"IF(MIN(Results!H60,Results!H66)=Results!H60,1,'Factor Results'!AH173)","v":1},{"$f":"IF(MIN(Results!I60,Results!I66)=Results!I60,1,'Factor Results'!AI173)","v":1},{"$f":"IF(MIN(Results!J60,Results!J66)=Results!J60,1,'Factor Results'!AJ173)","v":1},{"$f":"IF(MIN(Results!L60,Results!L66)=Results!L60,1,'Factor Results'!AU173)","v":1},{"$f":"IF(MIN(Results!M60,Results!M66)=Results!M60,1,'Factor Results'!AV173)","v":1},{"$f":"IF(MIN(Results!N60,Results!N66)=Results!N60,1,'Factor Results'!AW173)","v":1},{"$f":"IF(MIN(Results!O60,Results!O66)=Results!O60,1,'Factor Results'!AX173)","v":1},{"$f":"IF(MIN(Results!P60,Results!P66)=Results!P60,1,'Factor Results'!AY173)","v":1},{"$f":"IF(MIN(Results!Q60,Results!Q66)=Results!Q60,1,'Factor Results'!AZ173)","v":1}]
[null,"90 mil",1,1,1,1,1,{"$f":"IF(Input!$B$33=\"No\",\"\",1)","v":""},1,1,1,1,1,{"$f":"IF(Input!$B$33=\"No\",\"\",1)","v":""},null,"Tape",{"$f":"IF(MIN(Results!E60,Results!E66)=Results!E60,'Factor Results'!AE155,1)","v":1},{"$f":"IF(MIN(Results!F60,Results!F66)=Results!F60,'Factor Results'!AF155,1)","v":1},{"$f":"IF(MIN(Results!G60,Results!G66)=Results!G60,'Factor Results'!AG155,1)","v":1},{"$f":"IF(MIN(Results!H60,Results!H66)=Results!H60,'Factor Results'!AH155,1)","v":1},{"$f":"IF(MIN(Results!I60,Results!I66)=Results!I60,'Factor Results'!AI155,1)","v":1},{"$f":"IF(MIN(Results!J60,Results!J66)=Results!J60,'Factor Results'!AJ155,1)","v":{"$error":"#VALUE!"}},{"$f":"IF(MIN(Results!L60,Results!L66)=Results!L60,'Factor Results'!AU155,1)","v":1},{"$f":"IF(MIN(Results!M60,Results!M66)=Results!M60,'Factor Results'!AV155,1)","v":1},{"$f":"IF(MIN(Results!N60,Results!N66)=Results!N60,'Factor Results'!AW155,1)","v":1},{"$f":"IF(MIN(Results!O60,Results!O66)=Results!O60,'Factor Results'!AX155,1)","v":1},{"$f":"IF(MIN(Results!P60,Results!P66)=Results!P60,'Factor Results'!AY155,1)","v":1},{"$f":"IF(MIN(Results!Q60,Results!Q66)=Results!Q60,'Factor Results'!AZ155,1)","v":{"$error":"#VALUE!"}}]
[null,"Tape",{"$f":"Q10/Q9","v":1},{"$f":"R10/R9","v":1},1,1,1,{"$f":"IF(Input!$B$33=\"No\",\"\",V10/V9)","v":""},{"$f":"W10/W9","v":1},{"$f":"X10/X9","v":1},1,1,1,{"$f":"IF(Input!$B$33=\"No\",\"\",AB10/AB9)","v":""}]
[null,"Inverted","N/A","N/A","N/A","N/A","N/A","N/A","N/A","N/A","N/A","N/A","N/A","N/A"]
["Tape","40 mil",{"$f":"Q7/Q8","v":1},{"$f":"R7/R8","v":1.1309458159606991},{"$f":"S7/S8","v":2.5993843768270075},{"$f":"T7/T8","v":38.628587061712409},{"$f":"U7/U8","v":1000.407075756193},{"$f":"IF(Input!$B$33=\"No\",\"\",V7/V8)","v":""},{"$f":"W7/W8","v":1},{"$f":"X7/X8","v":1.1288738523510815},{"$f":"Y7/Y8","v":1.8026111610827802},{"$f":"Z7/Z8","v":3.5706823794538298},{"$f":"AA7/AA8","v":23.438113610816934},{"$f":"IF(Input!$B$33=\"No\",\"\",AB7/AB8)","v":""}]
[null,"90 mil",{"$f":"Q9/Q10","v":1},{"$f":"R9/R10","v":1},{"$f":"S9/S10","v":1},{"$f":"T9/T10","v":1},{"$f":"U9/U10","v":1},{"$f":"IF(Input!$B$33=\"No\",\"\",V9/V10)","v":""},{"$f":"W9/W10","v":1},{"$f":"X9/X10","v":1},{"$f":"Y9/Y10","v":1},{"$f":"Z9/Z10","v":1},{"$f":"AA9/AA10","v":1},{"$f":"IF(Input!$B$33=\"No\",\"\",AB9/AB10)","v":""}]
[null,"Tape",1,1,1,1,1,{"$f":"IF(Input!$B$33=\"No\",\"\",1)","v":""},1,1,1,1,1,{"$f":"IF(Input!$B$33=\"No\",\"\",1)","v":""},null,"Bidding Factors for New Stripe-AC: White Edge Line"]
[null,"Inverted","N/A","N/A","N/A","N/A","N/A","N/A","N/A","N/A","N/A","N/A","N/A","N/A",null,"Material","Off-Peak Application",null,null,null,null,null,"Night Time Application"]
["Inverted","40 mil","N/A","N/A","N/A","N/A","N/A","N/A","N/A","N/A","N/A","N/A","N/A","N/A",null,null,"ADT per Lane",null,null,null,null,"User ADT","ADT per Lane",null,null,null,null,"User ADT"]
[null,"90 mil","N/A","N/A","N/A","N/A","N/A","N/A","N/A","N/A","N/A","N/A","N/A","N/A",null,null,5000,10000,15000,20000,25000,null,5000,10000,15000,20000,25000,{"$f":"IF(Input!$B$33=\"No\",\"\",Input!$B$33)","v":""}]
[null,"Tape","N/A","N/A","N/A","N/A","N/A","N/A","N/A","N/A","N/A","N/A","N/A","N/A",null,"40 mil",{"$f":"IF(MIN(Results!E55,Results!E61)=Results!E55,1,'Factor Results'!AE144)","v":1},{"$f":"IF(MIN(Results!F55,Results!F61)=Results!F55,1,'Factor Results'!AF144)","v":1},{"$f":"IF(MIN(Results!G55,Results!G61)=Results!G55,1,'Factor Results'!AG144)","v":1},{"$f":"IF(MIN(Results!H55,Results!H61)=Results!H55,1,'Factor Results'!AH144)","v":1.2969900029115007},{"$f":"IF(MIN(Results!I55,Results!I61)=Results!I55,1,'Factor Results'!AI144)","v":1},{"$f":"IF(MIN(Results!J55,Results!J61)=Results!J55,1,'Factor Results'!AJ144)","v":1},{"$f":"IF(MIN(Results!L55,Results!L61)=Results!L55,1,'Factor Results'!AU144)","v":1},{"$f":"IF(MIN(Results!M55,Results!M61)=Results!M55,1,'Factor Results'!AV144)","v":1},{"$f":"IF(MIN(Results!N55,Results!N61)=Results!N55,1,'Factor Results'!AW144)","v":1},{"$f":"IF(MIN(Results!O55,Results!O61)=Results!O55,1,'Factor Results'!AX144)","v":1.0350459770998295},{"$f":"IF(MIN(Results!P55,Results!P61)=Results!P55,1,'Factor Results'!AY144)","v":1.7884017357974011},{"$f":"IF(MIN(Results!Q55,Results!Q61)=Results!Q55,1,'Factor Results'!AZ144)","v":1}]
[null,"Inverted","N/A","N/A","N/A","N/A","N/A","N/A","N/A","N/A","N/A","N/A","N/A","N/A",null,"90 mil",{"$f":"IF(MIN(Results!E55,Results!E61)=Results!E55,'Factor Results'!AE126,1)","v":1},{"$f":"IF(MIN(Results!F55,Results!F61)=Results!F55,'Factor Results'!AF126,1)","v":1},{"$f":"IF(MIN(Results!G55,Results!G61)=Results!G55,'Factor Results'!AG126,1)","v":1},{"$f":"IF(MIN(Results!H55,Results!H61)=Results!H55,'Factor Results'!AH126,1)","v":1},{"$f":"IF(MIN(Results!I55,Results!I61)=Results!I55,'Factor Results'!AI126,1)","v":2.5545687452063745E-2},{"$f":"IF(MIN(Results!J55,Results!J61)=Results!J55,'Factor Results'!AJ126,1)","v":{"$error":"#VALUE!"}},{"$f":"IF(MIN(Results!L55,Results!L61)=Results!L55,'Factor Results'!AU126,1)","v":1},{"$f":"IF(MIN(Results!M55,Results!M61)=Results!M55,'Factor Results'!AV126,1)","v":1},{"$f":"IF(MIN(Results!N55,Results!N61)=Results!N55,'Factor Results'!AW126,1)","v":1},{"$f":"IF(MIN(Results!O55,Results!O61)=Results!O55,'Factor Results'!AX126,1)","v":1},{"$f":"IF(MIN(Results!P55,Results!P61)=Results!P55,'Factor Results'!AY126,1)","v":1},{"$f":"IF(MIN(Results!Q55,Results!Q61)=Results!Q55,'Factor Results'!AZ126,1)","v":{"$error":"#VALUE!"}}]
[null,null,null,null,null,null,null,null,null,null,null,null,null,null,null,"40 mil",{"$f":"IF(MIN(Results!E55,Results!E67)=Results!E55,1,'Factor Results'!AE168)","v":1},{"$f":"IF(MIN(Results!F55,Results!F67)=Results!F55,1,'Factor Results'!AF168)","v":1},{"$f":"IF(MIN(Results!G55,Results!G67)=Results!G55,1,'Factor Results'!AG168)","v":1},{"$f":"IF(MIN(Results!H55,Results!H67)=Results!H55,1,'Factor Results'!AH168)","v":1.1017704687014047},{"$f":"IF(MIN(Results!I55,Results!I67)=Results!I55,1,'Factor Results'!AI168)","v":1},{"$f":"IF(MIN(Results!J55,Results!J67)=Results!J55,1,'Factor Results'!AJ168)","v":1},{"$f":"IF(MIN(Results!L55,Results!L67)=Results!L55,1,'Factor Results'!AU168)","v":1},{"$f":"IF(MIN(Results!M55,Results!M67)=Results!M55,1,'Factor Results'!AV168)","v":1},{"$f":"IF(MIN(Results!N55,Results!N67)=Results!N55,1,'Factor Results'!AW168)","v":1},{"$f":"IF(MIN(Results!O55,Results!O67)=Results!O55,1,'Factor Results'!AX168)","v":1.034357688180507},{"$f":"IF(MIN(Results!P55,Results!P67)=Results!P55,1,'Factor Results'!AY168)","v":1.63613461638706},{"$f":"IF(MIN(Results!Q55,Results!Q67)=Results!Q55,1,'Factor Results'!AZ168)","v":1}]
["Bidding Factors for New Stripe-AC: White Edge Line",null,null,null,null,null,null,null,null,null,null,null,null,null,null,"Tape",{"$f":"IF(MIN(Results!E55,Results!E67)=Results!E55,'Factor Results'!AE132,1)","v":1},{"$f":"IF(MIN(Results!F55,Results!F67)=Results!F55,'Factor Results'!AF132,1)","v":1},{"$f":"IF(MIN(Results!G55,Results!G67)=Results!G55,'Factor Results'!AG132,1)","v":1},{"$f":"IF(MIN(Results!H55,Results!H67)=Results!H55,'Factor Results'!AH132,1)","v":1},{"$f":"IF(MIN(Results!I55,Results!I67)=Results!I55,'Factor Results'!AI132,1)","v":2.5545687452063745E-2},{"$f":"IF(MIN(Results!J55,Results!J67)=Results!J55,'Factor Results'!AJ132,1)","v":{"$error":"#VALUE!"}},{"$f":"IF(MIN(Results!L55,Results!L67)=Results!L55,'Factor Results'!AU132,1)","v":1},{"$f":"IF(MIN(Results!M55,Results!M67)=Results!M55,'Factor Results'!AV132,1)","v":1},{"$f":"IF(MIN(Results!N55,Results!N67)=Results!N55,'Factor Results'!AW132,1)","v":1},{"$f":"IF(MIN(Results!O55,Results!O67)=Results!O55,'Factor Results'!AX132,1)","v":1},{"$f":"IF(MIN(Results!P55,Results!P67)=Results!P55,'Factor Results'!AY132,1)","v":1},{"$f":"IF(MIN(Results!Q55,Results!Q67)=Results!Q55,'Factor Results'!AZ132,1)","v":{"$error":"#VALUE!"}}]
["Reference Material","Material","Off-Peak Application",null,null,null,null,null,"Night Time Application",null,null,null,null,null,null,"90 mil",{"$f":"IF(MIN(Results!E61,Results!E67)=Results!E61,1,'Factor Results'!AE174)","v":1},{"$f":"IF(MIN(Results!F61,Results!F67)=Results!F61,1,'Factor Results'!AF174)","v":1},{"$f":"IF(MIN(Results!G61,Results!G67)=Results!G61,1,'Factor Results'!AG174)","v":1},{"$f":"IF(MIN(Results!H61,Results!H67)=Results!H61,1,'Factor Results'!AH174)","v":1},{"$f":"IF(MIN(Results!I61,Results!I67)=Results!I61,1,'Factor Results'!AI174)","v":1},{"$f":"IF(MIN(Results!J61,Results!J67)=Results!J61,1,'Factor Results'!AJ174)","v":1},{"$f":"IF(MIN(Results!L61,Results!L67)=Results!L61,1,'Factor Results'!AU174)","v":1},{"$f":"IF(MIN(Results!M61,Results!M67)=Results!M61,1,'Factor Results'!AV174)","v":1},{"$f":"IF(MIN(Results!N61,Results!N67)=Results!N61,1,'Factor Results'!AW174)","v":1},{"$f":"IF(MIN(Results!O61,Results!O67)=Results!O61,1,'Factor Results'!AX174)","v":1},{"$f":"IF(MIN(Results!P61,Results!P67)=Results!P61,1,'Factor Results'!AY174)","v":1},{"$f":"IF(MIN(Results!Q61,Results!Q67)=Results!Q61,1,'Factor Results'!AZ174)","v":1}]
[null,null,"ADT per Lane",null,null,null,null,"User ADT","ADT per Lane",null,null,null,null,"User ADT",null,"Tape",{"$f":"IF(MIN(Results!E61,Results!E67)=Results!E61,'Factor Results'!AE156,1)","v":1},{"$f":"IF(MIN(Results!F61,Results!F67)=Results!F61,'Factor Results'!AF156,1)","v":1},{"$f":"IF(MIN(Results!G61,Results!G67)=Results!G61,'Factor Results'!AG156,1)","v":1},{"$f":"IF(MIN(Results!H61,Results!H67)=Results!H61,'Factor Results'!AH156,1)","v":1},{"$f":"IF(MIN(Results!I61,Results!I67)=Results!I61,'Factor Results'!AI156,1)","v":1},{"$f":"IF(MIN(Results!J61,Results!J67)=Results!J61,'Factor Results'!AJ156,1)","v":{"$error":"#VALUE!"}},{"$f":"IF(MIN(Results!L61,Results!L67)=Results!L61,'Factor Results'!AU156,1)","v":1},{"$f":"IF(MIN(Results!M61,Results!M67)=Results!M61,'Factor Results'!AV156,1)","v":1},{"$f":"IF(MIN(Results!N61,Results!N67)=Results!N61,'Factor Results'!AW156,1)","v":1},{"$f":"IF(MIN(Results!O61,Results!O67)=Results!O61,'Factor Results'!AX156,1)","v":1},{"$f":"IF(MIN(Results!P61,Results!P67)=Results!P61,'Factor Results'!AY156,1)","v":1},{"$f":"IF(MIN(Results!Q61,Results!Q67)=Results!Q61,'Factor Results'!AZ156,1)","v":{"$error":"#VALUE!"}}]
[null,null,5000,10000,15000,20000,25000,{"$f":"IF(Input!$B$33=\"No\",\"\",Input!$B$33)","v":""},5000,10000,15000,20000,25000,{"$f":"IF(Input!$B$33=\"No\",\"\",Input!$B$33)","v":""}]
["40 mil","40 mil",1,1,1,1,1,{"$f":"IF(Input!$B$33=\"No\",\"\",1)","v":""},1,1,1,1,1,{"$f":"IF(Input!$B$33=\"No\",\"\",1)","v":""}]
[null,"90 mil",{"$f":"Q20/Q19","v":1},{"$f":"R20/R19","v":1},{"$f":"S20/S19","v":1},{"$f":"T20/T19","v":0.77101596600990485},{"$f":"U20/U19","v":2.5545687452063745E-2},{"$f":"IF(Input!$B$33=\"No\",\"\",V20/V19)","v":""},{"$f":"W20/W19","v":1},{"$f":"X20/X19","v":1},{"$f":"Y20/Y19","v":1},{"$f":"Z20/Z19","v":0.96614065667109073},{"$f":"AA20/AA19","v":0.55915848211482888},{"$f":"IF(Input!$B$33=\"No\",\"\",AB20/AB19)","v":""}]
[null,"Tape",{"$f":"Q22/Q21","v":1},{"$f":"R22/R21","v":1},{"$f":"S22/S21","v":1},{"$f":"T22/T21","v":0.90763006307352212},{"$f":"U22/U21","v":2.5545687452063745E-2},{"$f":"IF(Input!$B$33=\"No\",\"\",V22/V21)","v":""},{"$f":"W22/W21","v":1},{"$f":"X22/X21","v":1},{"$f":"Y22/Y21","v":1},{"$f":"Z22/Z21","v":0.96678355217628431},{"$f":"AA22/AA21","v":0.61119665214847463},{"$f":"IF(Input!$B$33=\"No\",\"\",AB22/AB21)","v":""}]
[null,"Inverted","N/A","N/A","N/A","N/A","N/A","N/A","N/A","N/A","N/A","N/A","N/A","N/A",null,"Bidding Factors for New Stripe-AC: White Lane Line"]
["90 mil","40 mil",{"$f":"Q19/Q20","v":1},{"$f":"R19/R20","v":1},{"$f":"S19/S20","v":1},{"$f":"T19/T20","v":1.2969900029115007},{"$f":"U19/U20","v":39.145550569993119},{"$f":"IF(Input!$B$33=\"No\",\"\",V19/V20)","v":""},{"$f":"W19/W20","v":1},{"$f":"X19/X20","v":1},{"$f":"Y19/Y20","v":1},{"$f":"Z19/Z20","v":1.0350459770998295},{"$f":"AA19/AA20","v":1.7884017357974011},{"$f":"IF(Input!$B$33=\"No\",\"\",AB19/AB20)","v":""},null,"Material","Off-Peak Application",null,null,null,null,null,"Night Time Application"]
[null,"90 mil",1,1,1,1,1,{"$f":"IF(Input!$B$33=\"No\",\"\",1)","v":""},1,1,1,1,1,{"$f":"IF(Input!$B$33=\"No\",\"\",1)","v":""},null,null,"ADT per Lane",null,null,null,null,"User ADT","ADT per Lane",null,null,null,null,"User ADT"]
[null,"Tape",{"$f":"Q24/Q23","v":1},{"$f":"R24/R23","v":1},{"$f":"S24/S23","v":1},{"$f":"T24/T23","v":1},{"$f":"U24/U23","v":1},{"$f":"IF(Input!$B$33=\"No\",\"\",V24/V23)","v":""},{"$f":"W24/W23","v":1},{"$f":"X24/X23","v":1},{"$f":"Y24/Y23","v":1},{"$f":"Z24/Z23","v":1},{"$f":"AA24/AA23","v":1},{"$f":"IF(Input!$B$33=\"No\",\"\",AB24/AB23)","v":""},null,null,5000,10000,15000,20000,25000,null,5000,10000,15000,20000,25000,{"$f":"IF(Input!$B$33=\"No\",\"\",Input!$B$33)","v":""}]
[null,"Inverted","N/A","N/A","N/A","N/A","N/A","N/A","N/A","N/A","N/A","N/A","N/A","N/A",null,"40 mil",{"$f":"IF(MIN(Results!E56,Results!E62)=Results!E56,1,'Factor Results'!AE145)","v":1},{"$f":"IF(MIN(Results!F56,Results!F62)=Results!F56,1,'Factor Results'!AF145)","v":1},{"$f":"IF(MIN(Results!G56,Results!G62)=Results!G56,1,'Factor Results'!AG145)","v":1},{"$f":"IF(MIN(Results!H56,Results!H62)=Results!H56,1,'Factor Results'!AH145)","v":1},{"$f":"IF(MIN(Results!I56,Results!I62)=Results!I56,1,'Factor Results'!AI145)","v":1},{"$f":"IF(MIN(Results!J56,Results!J62)=Results!J56,1,'Factor Results'!AJ145)","v":1},{"$f":"IF(MIN(Results!L56,Results!L62)=Results!L56,1,'Factor Results'!AU145)","v":1},{"$f":"IF(MIN(Results!M56,Results!M62)=Results!M56,1,'Factor Results'!AV145)","v":1},{"$f":"IF(MIN(Results!N56,Results!N62)=Results!N56,1,'Factor Results'!AW145)","v":1},{"$f":"IF(MIN(Results!O56,Results!O62)=Results!O56,1,'Factor Results'!AX145)","v":1.0370350251400307},{"$f":"IF(MIN(Results!P56,Results!P62)=Results!P56,1,'Factor Results'!AY145)","v":1},{"$f":"IF(MIN(Results!Q56,Results!Q62)=Results!Q56,1,'Factor Results'!AZ145)","v":1}]
["Tape","40 mil",{"$f":"Q21/Q22","v":1},{"$f":"R21/R22","v":1},{"$f":"S21/S22","v":1},{"$f":"T21/T22","v":1.1017704687014047},{"$f":"U21/U22","v":39.145550569993119},{"$f":"IF(Input!$B$33=\"No\",\"\",V21/V22)","v":""},{"$f":"W21/W22","v":1},{"$f":"X21/X22","v":1},{"$f":"Y21/Y22","v":1},{"$f":"Z21/Z22","v":1.034357688180507},{"$f":"AA21/AA22","v":1.63613461638706},{"$f":"IF(Input!$B$33=\"No\",\"\",AB21/AB22)","v":""},null,"90 mil",{"$f":"IF(MIN(Results!E56,Results!E62)=Results!E56,'Factor Results'!AE127,1)","v":1},{"$f":"IF(MIN(Results!F56,Results!F62)=Results!F56,'Factor Results'!AF127,1)","v":1},{"$f":"IF(MIN(Results!G56,Results!G62)=Results!G56,'Factor Results'!AG127,1)","v":1},{"$f":"IF(MIN(Results!H56,Results!H62)=Results!H56,'Factor Results'!AH127,1)","v":0.43318658644248786},{"$f":"IF(MIN(Results!I56,Results!I62)=Results!I56,'Factor Results'!AI127,1)","v":9.8613161356549302E-3},{"$f":"IF(MIN(Results!J56,Results!J62)=Results!J56,'Factor Results'!AJ127,1)","v":{"$error":"#VALUE!"}},{"$f":"IF(MIN(Results!L56,Results!L62)=Results!L56,'Factor Results'!AU127,1)","v":1},{"$f":"IF(MIN(Results!M56,Results!M62)=Results!M56,'Factor Results'!AV127,1)","v":1},{"$f":"IF(MIN(Results!N56,Results!N62)=Results!N56,'Factor Results'!AW127,1)","v":1},{"$f":"IF(MIN(Results!O56,Results!O62)=Results!O56,'Factor Results'!AX127,1)","v":1},{"$f":"IF(MIN(Results!P56,Results!P62)=Results!P56,'Factor Results'!AY127,1)","v":0.43134105951988277},{"$f":"IF(MIN(Results!Q56,Results!Q62)=Results!Q56,'Factor Results'!AZ127,1)","v":{"$error":"#VALUE!"}}]
[null,"90 mil",{"$f":"Q23/Q24","v":1},{"$f":"R23/R24","v":1},{"$f":"S23/S24","v":1},{"$f":"T23/T24","v":1},{"$f":"U23/U24","v":1},{"$f":"IF(Input!$B$33=\"No\",\"\",V23/V24)","v":""},{"$f":"W23/W24","v":1},{"$f":"X23/X24","v":1},{"$f":"Y23/Y24","v":1},{"$f":"Z23/Z24","v":1},{"$f":"AA23/AA24","v":1},{"$f":"IF(Input!$B$33=\"No\",\"\",AB23/AB24)","v":""},null,"40 mil",{"$f":"IF(MIN(Results!E56,Results!E68)=Results!E56,1,'Factor Results'!AE169)","v":1},{"$f":"IF(MIN(Results!F56,Results!F68)=Results!F56,1,'Factor Results'!AF169)","v":1},{"$f":"IF(MIN(Results!G56,Results!G68)=Results!G56,1,'Factor Results'!AG169)","v":1},{"$f":"IF(MIN(Results!H56,Results!H68)=Results!H56,1,'Factor Results'!AH169)","v":1.1872887335293625},{"$f":"IF(MIN(Results!I56,Results!I68)=Results!I56,1,'Factor Results'!AI169)","v":1},{"$f":"IF(MIN(Results!J56,Results!J68)=Results!J56,1,'Factor Results'!AJ169)","v":1},{"$f":"IF(MIN(Results!L56,Results!L68)=Results!L56,1,'Factor Results'!AU169)","v":1},{"$f":"IF(MIN(Results!M56,Results!M68)=Results!M56,1,'Factor Results'!AV169)","v":1},{"$f":"IF(MIN(Results!N56,Results!N68)=Results!N56,1,'Factor Results'!AW169)","v":1},{"$f":"IF(MIN(Results!O56,Results!O68)=Results!O56,1,'Factor Results'!AX169)","v":1.0346869459230033},{"$f":"IF(MIN(Results!P56,Results!P68)=Results!P56,1,'Factor Results'!AY169)","v":1.7056276327219722},{"$f":"IF(MIN(Results!Q56,Results!Q68)=Results!Q56,1,'Factor Results'!AZ169)","v":1}]
[null,"Tape",1,1,1,1,1,{"$f":"IF(Input!$B$33=\"No\",\"\",1)","v":""},1,1,1,1,1,{"$f":"IF(Input!$B$33=\"No\",\"\",1)","v":""},null,"Tape",{"$f":"IF(MIN(Results!E56,Results!E68)=Results!E56,'Factor Results'!AE133,1)","v":1},{"$f":"IF(MIN(Results!F56,Results!F68)=Results!F56,'Factor Results'!AF133,1)","v":1},{"$f":"IF(MIN(Results!G56,Results!G68)=Results!G56,'Factor Results'!AG133,1)","v":1},{"$f":"IF(MIN(Results!H56,Results!H68)=Results!H56,'Factor Results'!AH133,1)","v":1},{"$f":"IF(MIN(Results!I56,Results!I68)=Results!I56,'Factor Results'!AI133,1)","v":9.8613161356549302E-3},{"$f":"IF(MIN(Results!J56,Results!J68)=Results!J56,'Factor Results'!AJ133,1)","v":{"$error":"#VALUE!"}},{"$f":"IF(MIN(Results!L56,Results!L68)=Results!L56,'Factor Results'!AU133,1)","v":1},{"$f":"IF(MIN(Results!M56,Results!M68)=Results!M56,'Factor Results'!AV133,1)","v":1},{"$f":"IF(MIN(Results!N56,Results!N68)=Results!N56,'Factor Results'!AW133,1)","v":1},{"$f":"IF(MIN(Results!O56,Results!O68)=Results!O56,'Factor Results'!AX133,1)","v":1},{"$f":"IF(MIN(Results!P56,Results!P68)=Results!P56,'Factor Results'!AY133,1)","v":1},{"$f":"IF(MIN(Results!Q56,Results!Q68)=Results!Q56,'Factor Results'!AZ133,1)","v":{"$error":"#VALUE!"}}]
[null,"Inverted","N/A","N/A","N/A","N/A","N/A","N/A","N/A","N/A","N/A","N/A","N/A","N/A",null,"90 mil",{"$f":"IF(MIN(Results!E62,Results!E68)=Results!E62,1,'Factor Results'!AE175)","v":1},{"$f":"IF(MIN(Results!F62,Results!F68)=Results!F62,1,'Factor Results'!AF175)","v":1},{"$f":"IF(MIN(Results!G62,Results!G68)=Results!G62,1,'Factor Results'!AG175)","v":1},{"$f":"IF(MIN(Results!H62,Results!H68)=Results!H62,1,'Factor Results'!AH175)","v":1},{"$f":"IF(MIN(Results!I62,Results!I68)=Results!I62,1,'Factor Results'!AI175)","v":1},{"$f":"IF(MIN(Results!J62,Results!J68)=Results!J62,1,'Factor Results'!AJ175)","v":1},{"$f":"IF(MIN(Results!L62,Results!L68)=Results!L62,1,'Factor Results'!AU175)","v":1},{"$f":"IF(MIN(Results!M62,Results!M68)=Results!M62,1,'Factor Results'!AV175)","v":1},{"$f":"IF(MIN(Results!N62,Results!N68)=Results!N62,1,'Factor Results'!AW175)","v":1},{"$f":"IF(MIN(Results!O62,Results!O68)=Results!O62,1,'Factor Results'!AX175)","v":1},{"$f":"IF(MIN(Results!P62,Results!P68)=Results!P62,1,'Factor Results'!AY175)","v":1},{"$f":"IF(MIN(Results!Q62,Results!Q68)=Results!Q62,1,'Factor Results'!AZ175)","v":1}]
["Inverted","40 mil","N/A","N/A","N/A","N/A","N/A","N/A","N/A","N/A","N/A","N/A","N/A","N/A",null,"Tape",{"$f":"IF(MIN(Results!E62,Results!E68)=Results!E62,'Factor Results'!AE157,1)","v":1},{"$f":"IF(MIN(Results!F62,Results!F68)=Results!F62,'Factor Results'!AF157,1)","v":1},{"$f":"IF(MIN(Results!G62,Results!G68)=Results!G62,'Factor Results'!AG157,1)","v":1},{"$f":"IF(MIN(Results!H62,Results!H68)=Results!H62,'Factor Results'!AH157,1)","v":1},{"$f":"IF(MIN(Results!I62,Results!I68)=Results!I62,'Factor Results'!AI157,1)","v":1},{"$f":"IF(MIN(Results!J62,Results!J68)=Results!J62,'Factor Results'!AJ157,1)","v":{"$error":"#VALUE!"}},{"$f":"IF(MIN(Results!L62,Results!L68)=Results!L62,'Factor Results'!AU157,1)","v":1},{"$f":"IF(MIN(Results!M62,Results!M68)=Results!M62,'Factor Results'!AV157,1)","v":1},{"$f":"IF(MIN(Results!N62,Results!N68)=Results!N62,'Factor Results'!AW157,1)","v":1},{"$f":"IF(MIN(Results!O62,Results!O68)=Results!O62,'Factor Results'!AX157,1)","v":1},{"$f":"IF(MIN(Results!P62,Results!P68)=Results!P62,'Factor Results'!AY157,1)","v":1},{"$f":"IF(MIN(Results!Q62,Results!Q68)=Results!Q62,'Factor Results'!AZ157,1)","v":{"$error":"#VALUE!"}}]
[null,"90 mil","N/A","N/A","N/A","N/A","N/A","N/A","N/A","N/A","N/A","N/A","N/A","N/A"]
[null,"Tape","N/A","N/A","N/A","N/A","N/A","N/A","N/A","N/A","N/A","N/A","N/A","N/A"]
[null,"Inverted","N/A","N/A","N/A","N/A","N/A","N/A","N/A","N/A","N/A","N/A","N/A","N/A"]
[]
["Bidding Factors for New Stripe-AC: White Edge Line"]
["Reference Material","Material","Off-Peak Application",null,null,null,null,null,"Night Time Application"]
[null,null,"ADT per Lane",null,null,null,null,"User ADT","ADT per Lane",null,null,null,null,"User ADT"]
[null,null,5000,10000,15000,20000,25000,{"$f":"IF(Input!$B$33=\"No\",\"\",Input!$B$33)","v":""},5000,10000,15000,20000,25000,{"$f":"IF(Input!$B$33=\"No\",\"\",Input!$B$33)","v":""}]
["40 mil","40 mil",1,1,1,1,1,{"$f":"IF(Input!$B$33=\"No\",\"\",1)","v":""},1,1,1,1,1,{"$f":"IF(Input!$B$33=\"No\",\"\",1)","v":""}]
[null,"90 mil",{"$f":"Q34/Q33","v":1},{"$f":"R34/R33","v":1},{"$f":"S34/S33","v":1},{"$f":"T34/T33","v":0.43318658644248786},{"$f":"U34/U33","v":9.8613161356549302E-3},{"$f":"IF(Input!$B$33=\"No\",\"\",V34/V33)","v":""},{"$f":"W34/W33","v":1},{"$f":"X34/X33","v":1},{"$f":"Y34/Y33","v":1},{"$f":"Z34/Z33","v":0.96428758504561618},{"$f":"AA34/AA33","v":0.43134105951988277},{"$f":"IF(Input!$B$33=\"No\",\"\",AB34/AB33)","v":""}]
[null,"Tape",{"$f":"Q36/Q35","v":1},{"$f":"R36/R35","v":1},{"$f":"S36/S35","v":1},{"$f":"T36/T35","v":0.84225510759070077},{"$f":"U36/U35","v":9.8613161356549302E-3},{"$f":"IF(Input!$B$33=\"No\",\"\",V36/V35)","v":""},{"$f":"W36/W35","v":1},{"$f":"X36/X35","v":1},{"$f":"Y36/Y35","v":1},{"$f":"Z36/Z35","v":0.96647590262960126},{"$f":"AA36/AA35","v":0.58629444130435604},{"$f":"IF(Input!$B$33=\"No\",\"\",AB36/AB35)","v":""}]
[null,"Inverted","N/A","N/A","N/A","N/A","N/A","N/A","N/A","N/A","N/A","N/A","N/A","N/A"]
["90 mil","40 mil",{"$f":"Q33/Q34","v":1},{"$f":"R33/R34","v":1},{"$f":"S33/S34","v":1},{"$f":"T33/T34","v":2.308474064749845},{"$f":"U33/U34","v":101.40634234251591},{"$f":"IF(Input!$B$33=\"No\",\"\",V33/V34)","v":""},{"$f":"W33/W34","v":1},{"$f":"X33/X34","v":1},{"$f":"Y33/Y34","v":1},{"$f":"Z33/Z34","v":1.0370350251400307},{"$f":"AA33/AA34","v":2.3183510540663117},{"$f":"IF(Input!$B$33=\"No\",\"\",AB33/AB34)","v":""}]
[null,"90 mil",1,1,1,1,1,{"$f":"IF(Input!$B$33=\"No\",\"\",1)","v":""},1,1,1,1,1,{"$f":"IF(Input!$B$33=\"No\",\"\",1)","v":""}]
[null,"Tape",{"$f":"Q38/Q37","v":1},{"$f":"R38/R37","v":1},{"$f":"S38/S37","v":1},{"$f":"T38/T37","v":1},{"$f":"U38/U37","v":1},{"$f":"IF(Input!$B$33=\"No\",\"\",V38/V37)","v":""},{"$f":"W38/W37","v":1},{"$f":"X38/X37","v":1},{"$f":"Y38/Y37","v":1},{"$f":"Z38/Z37","v":1},{"$f":"AA38/AA37","v":1},{"$f":"IF(Input!$B$33=\"No\",\"\",AB38/AB37)","v":""}]
[null,"Inverted","N/A","N/A","N/A","N/A","N/A","N/A","N/A","N/A","N/A","N/A","N/A","N/A"]
["Tape","40 mil",{"$f":"Q35/Q36","v":1},{"$f":"R35/R36","v":1},{"$f":"S35/S36","v":1},{"$f":"T35/T36","v":1.1872887335293625},{"$f":"U35/U36","v":101.40634234251591},{"$f":"IF(Input!$B$33=\"No\",\"\",V35/V36)","v":""},{"$f":"W35/W36","v":1},{"$f":"X35/X36","v":1},{"$f":"Y35/Y36","v":1},{"$f":"Z35/Z36","v":1.0346869459230033},{"$f":"AA35/AA36","v":1.7056276327219722},{"$f":"IF(Input!$B$33=\"No\",\"\",AB35/AB36)","v":""}]
[null,"90 mil",{"$f":"Q37/Q38","v":1},{"$f":"R37/R38","v":1},{"$f":"S37/S38","v":1},{"$f":"T37/T38","v":1},{"$f":"U37/U38","v":1},{"$f":"IF(Input!$B$33=\"No\",\"\",V37/V38)","v":""},{"$f":"W37/W38","v":1},{"$f":"X37/X38","v":1},{"$f":"Y37/Y38","v":1},{"$f":"Z37/Z38","v":1},{"$f":"AA37/AA38","v":1},{"$f":"IF(Input!$B$33=\"No\",\"\",AB37/AB38)","v":""}]
[null,"Tape",1,1,1,1,1,{"$f":"IF(Input!$B$33=\"No\",\"\",1)","v":""},1,1,1,1,1,{"$f":"IF(Input!$B$33=\"No\",\"\",1)","v":""}]
[null,"Inverted","N/A","N/A","N/A","N/A","N/A","N/A","N/A","N/A","N/A","N/A","N/A","N/A"]
["Inverted","40 mil","N/A","N/A","N/A","N/A","N/A","N/A","N/A","N/A","N/A","N/A","N/A","N/A"]
[null,"90 mil","N/A","N/A","N/A","N/A","N/A","N/A","N/A","N/A","N/A","N/A","N/A","N/A"]
[null,"Tape","N/A","N/A","N/A","N/A","N/A","N/A","N/A","N/A","N/A","N/A","N/A","N/A"]
[null,"Inverted","N/A","N/A","N/A","N/A","N/A","N/A","N/A","N/A","N/A","N/A","N/A","N/A"]
[]
[null,null,null,null,null,null,null,"Number of lanes in one direction=",{"$f":"Input!B26","v":"2"}]

{"sheet":"Equivalent Cost Factors","index":16,"n_rows":81,"n_cols":15,"rows_kept":81,"cut":false,"hidden":true,"merged":[[77,1,80,1],[66,9,66,14],[67,3,67,7],[67,9,67,13],[69,1,72,1],[73,1,76,1],[56,1,59,1],[60,1,63,1],[66,1,68,1],[66,2,68,2],[66,3,66,8],[49,3,49,8],[49,9,49,14],[50,3,50,7],[50,9,50,13],[52,1,55,1],[35,1,38,1],[39,1,42,1],[43,1,46,1],[49,1,51,1],[49,2,51,2],[15,3,15,8],[15,9,15,14],[16,3,16,7],[16,9,16,13],[32,1,34,1],[32,2,34,2],[32,3,32,8],[32,9,32,14],[33,3,33,7],[33,9,33,13],[18,1,21,1],[22,1,25,1],[26,1,29,1],[15,1,17,1],[15,2,17,2]]}
[null,"Please select a reference material to compare to:"]
[null,"Important:","1. The factors are to be used to compare materials to the reference material only, not to compare among non-reference materials. "]
[null,null,"2. Multiply the factors with the corresponding bid prices for the same material. If a material has a lower equivalent cost than the reference materail,"]
[null,null,"   then it has a higher benefit/cost ratio than the reference material."]
[null,null,"3. To compare to a different material, please select that material as the reference. "]
[]
[null,null,null,null,null,"Candidate Reference Materials:"]
[null,null,null,null,null,"Choose A Material"]
[null,null,null,null,null,"40 mil"]
[null,null,null,null,null,"90 mil"]
[null,null,null,null,null,"Tape"]
[null,null,null,null,null,"Inverted"]
[null,null,null,null,{"$f":"'Intermediate Factor Output'!A1","v":"Equivalent Cost Factors for Restripe-PCC"},null,null,null,null,{"$f":"'Intermediate Factor Output'!H64","v":"Number of lanes in one direction="},null,null,null,{"$f":"'Intermediate Factor Output'!I64","v":"2"}]
[]
[null,"Reference Material: ",null,"Choose A Material"]
[null,"Line Type","Material","Off-Peak Application",null,null,null,null,null,"Night Time Application"]
[null,null,null,"ADT per Lane",null,null,null,null,"User ADT","ADT per Lane",null,null,null,null,"User ADT"]
[null,"Line Type",null,5000,10000,15000,20000,25000,{"$f":"IF(Input!$B$33=\"No\",\"\",Input!$B$33)","v":""},5000,10000,15000,20000,25000,{"$f":"IF(Input!$B$33=\"No\",\"\",Input!$B$33)","v":""}]
[null,"Yellow Edge Line","40 mil",{"$f":"'Intermediate Factor Output'!C5","v":1},{"$f":"'Intermediate Factor Output'!D5","v":1},{"$f":"'Intermediate Factor Output'!E5","v":1},{"$f":"'Intermediate Factor Output'!F5","v":1},{"$f":"'Intermediate Factor Output'!G5","v":1},{"$f":"'Intermediate Factor Output'!H5","v":""},{"$f":"'Intermediate Factor Output'!I5","v":1},{"$f":"'Intermediate Factor Output'!J5","v":1},{"$f":"'Intermediate Factor Output'!K5","v":1},{"$f":"'Intermediate Factor Output'!L5","v":1},{"$f":"'Intermediate Factor Output'!M5","v":1},{"$f":"'Intermediate Factor Output'!N5","v":""}]
[null,null,"90 mil",{"$f":"'Intermediate Factor Output'!C6","v":1},{"$f":"'Intermediate Factor Output'!D6","v":0.9938935067771707},{"$f":"'Intermediate Factor Output'!E6","v":0.96039654070883884},{"$f":"'Intermediate Factor Output'!F6","v":0.83626453388092892},{"$f":"'Intermediate Factor Output'!G6","v":0.47101390048704794},{"$f":"'Intermediate Factor Output'!H6","v":""},{"$f":"'Intermediate Factor Output'!I6","v":1},{"$f":"'Intermediate Factor Output'!J6","v":0.99398345625774764},{"$f":"'Intermediate Factor Output'!K6","v":0.9717440030251876},{"$f":"'Intermediate Factor Output'!L6","v":0.94299791162588176},{"$f":"'Intermediate Factor Output'!M6","v":0.9070375856158589},{"$f":"'Intermediate Factor Output'!N6","v":""}]
[null,null,"Tape",{"$f":"'Intermediate Factor Output'!C7","v":1},{"$f":"'Intermediate Factor Output'!D7","v":0.99394294969369323},{"$f":"'Intermediate Factor Output'!E7","v":0.96527587323897723},{"$f":"'Intermediate Factor Output'!F7","v":0.88162273715074224},{"$f":"'Intermediate Factor Output'!G7","v":0.47121072603076386},{"$f":"'Intermediate Factor Output'!H7","v":""},{"$f":"'Intermediate Factor Output'!I7","v":1},{"$f":"'Intermediate Factor Output'!J7","v":0.99399485346643512},{"$f":"'Intermediate Factor Output'!K7","v":0.9718237276733549},{"$f":"'Intermediate Factor Output'!L7","v":0.94321136386567672},{"$f":"'Intermediate Factor Output'!M7","v":0.90943863770556688},{"$f":"'Intermediate Factor Output'!N7","v":""}]
[null,null,"Inverted",{"$f":"'Intermediate Factor Output'!C8","v":1},{"$f":"'Intermediate Factor Output'!D8","v":0.99392475293691185},{"$f":"'Intermediate Factor Output'!E8","v":0.96348010483469293},{"$f":"'Intermediate Factor Output'!F8","v":0.86492930053744843},{"$f":"'Intermediate Factor Output'!G8","v":0.47101390048704794},{"$f":"'Intermediate Factor Output'!H8","v":""},{"$f":"'Intermediate Factor Output'!I8","v":1},{"$f":"'Intermediate Factor Output'!J8","v":0.99399065888712912},{"$f":"'Intermediate Factor Output'!K8","v":0.97179438615925684},{"$f":"'Intermediate Factor Output'!L8","v":0.94313280582814174},{"$f":"'Intermediate Factor Output'!M8","v":0.90855496489722554},{"$f":"'Intermediate Factor Output'!N8","v":""}]
[null,"White Edge Line","40 mil",{"$f":"'Intermediate Factor Output'!C26","v":1},{"$f":"'Intermediate Factor Output'!D26","v":1},{"$f":"'Intermediate Factor Output'!E26","v":1},{"$f":"'Intermediate Factor Output'!F26","v":1},{"$f":"'Intermediate Factor Output'!G26","v":1},{"$f":"'Intermediate Factor Output'!H26","v":""},{"$f":"'Intermediate Factor Output'!I26","v":1},{"$f":"'Intermediate Factor Output'!J26","v":1},{"$f":"'Intermediate Factor Output'!K26","v":1},{"$f":"'Intermediate Factor Output'!L26","v":1},{"$f":"'Intermediate Factor Output'!M26","v":1},{"$f":"'Intermediate Factor Output'!N26","v":""}]
[null,null,"90 mil",{"$f":"'Intermediate Factor Output'!C27","v":1},{"$f":"'Intermediate Factor Output'!D27","v":1},{"$f":"'Intermediate Factor Output'!E27","v":1},{"$f":"'Intermediate Factor Output'!F27","v":1},{"$f":"'Intermediate Factor Output'!G27","v":1},{"$f":"'Intermediate Factor Output'!H27","v":""},{"$f":"'Intermediate Factor Output'!I27","v":1},{"$f":"'Intermediate Factor Output'!J27","v":1},{"$f":"'Intermediate Factor Output'!K27","v":1},{"$f":"'Intermediate Factor Output'!L27","v":1},{"$f":"'Intermediate Factor Output'!M27","v":1},{"$f":"'Intermediate Factor Output'!N27","v":""}]
[null,null,"Tape",{"$f":"'Intermediate Factor Output'!C28","v":1},{"$f":"'Intermediate Factor Output'!D28","v":1},{"$f":"'Intermediate Factor Output'!E28","v":1},{"$f":"'Intermediate Factor Output'!F28","v":1},{"$f":"'Intermediate Factor Output'!G28","v":1},{"$f":"'Intermediate Factor Output'!H28","v":""},{"$f":"'Intermediate Factor Output'!I28","v":1},{"$f":"'Intermediate Factor Output'!J28","v":1},{"$f":"'Intermediate Factor Output'!K28","v":1},{"$f":"'Intermediate Factor Output'!L28","v":1},{"$f":"'Intermediate Factor Output'!M28","v":1},{"$f":"'Intermediate Factor Output'!N28","v":""}]
[null,null,"Inverted",{"$f":"'Intermediate Factor Output'!C29","v":1},{"$f":"'Intermediate Factor Output'!D29","v":1},{"$f":"'Intermediate Factor Output'!E29","v":1},{"$f":"'Intermediate Factor Output'!F29","v":1.5589918631002146},{"$f":"'Intermediate Factor Output'!G29","v":11.19418836617262},{"$f":"'Intermediate Factor Output'!H29","v":""},{"$f":"'Intermediate Factor Output'!I29","v":1},{"$f":"'Intermediate Factor Output'!J29","v":1},{"$f":"'Intermediate Factor Output'!K29","v":1},{"$f":"'Intermediate Factor Output'!L29","v":1.2353456297027765},{"$f":"'Intermediate Factor Output'!M29","v":2.4388266962374989},{"$f":"'Intermediate Factor Output'!N29","v":""}]
[null,"White Lane Line","40 mil",{"$f":"'Intermediate Factor Output'!C47","v":1},{"$f":"'Intermediate Factor Output'!D47","v":1},{"$f":"'Intermediate Factor Output'!E47","v":1},{"$f":"'Intermediate Factor Output'!F47","v":1},{"$f":"'Intermediate Factor Output'!G47","v":1},{"$f":"'Intermediate Factor Output'!H47","v":""},{"$f":"'Intermediate Factor Output'!I47","v":1},{"$f":"'Intermediate Factor Output'!J47","v":1},{"$f":"'Intermediate Factor Output'!K47","v":1},{"$f":"'Intermediate Factor Output'!L47","v":1},{"$f":"'Intermediate Factor Output'!M47","v":1},{"$f":"'Intermediate Factor Output'!N47","v":""}]
[null,null,"90 mil",{"$f":"'Intermediate Factor Output'!C48","v":1},{"$f":"'Intermediate Factor Output'!D48","v":1},{"$f":"'Intermediate Factor Output'!E48","v":1},{"$f":"'Intermediate Factor Output'!F48","v":1},{"$f":"'Intermediate Factor Output'!G48","v":1},{"$f":"'Intermediate Factor Output'!H48","v":""},{"$f":"'Intermediate Factor Output'!I48","v":1},{"$f":"'Intermediate Factor Output'!J48","v":1},{"$f":"'Intermediate Factor Output'!K48","v":1},{"$f":"'Intermediate Factor Output'!L48","v":1},{"$f":"'Intermediate Factor Output'!M48","v":1},{"$f":"'Intermediate Factor Output'!N48","v":""}]
[null,null,"Tape",{"$f":"'Intermediate Factor Output'!C49","v":1},{"$f":"'Intermediate Factor Output'!D49","v":1},{"$f":"'Intermediate Factor Output'!E49","v":1},{"$f":"'Intermediate Factor Output'!F49","v":1},{"$f":"'Intermediate Factor Output'!G49","v":1},{"$f":"'Intermediate Factor Output'!H49","v":""},{"$f":"'Intermediate Factor Output'!I49","v":1},{"$f":"'Intermediate Factor Output'!J49","v":1},{"$f":"'Intermediate Factor Output'!K49","v":1},{"$f":"'Intermediate Factor Output'!L49","v":1},{"$f":"'Intermediate Factor Output'!M49","v":1},{"$f":"'Intermediate Factor Output'!N49","v":""}]
[null,null,"Inverted",{"$f":"'Intermediate Factor Output'!C50","v":1},{"$f":"'Intermediate Factor Output'!D50","v":1},{"$f":"'Intermediate Factor Output'!E50","v":1},{"$f":"'Intermediate Factor Output'!F50","v":1.6749316429074772},{"$f":"'Intermediate Factor Output'!G50","v":14.339195108351021},{"$f":"'Intermediate Factor Output'!H50","v":""},{"$f":"'Intermediate Factor Output'!I50","v":1},{"$f":"'Intermediate Factor Output'!J50","v":1},{"$f":"'Intermediate Factor Output'!K50","v":1},{"$f":"'Intermediate Factor Output'!L50","v":1.2358912334502177},{"$f":"'Intermediate Factor Output'!M50","v":2.4621603220560568},{"$f":"'Intermediate Factor Output'!N50","v":""}]
[]
[]
[null,"Line Type","Material","Off-Peak Application",null,null,null,null,null,"Night Time Application"]
[null,null,null,"ADT per Lane",null,null,null,null,"User ADT","ADT per Lane",null,null,null,null,"User ADT"]
[null,"Line Type",null,5000,10000,15000,20000,25000,{"$f":"IF(Input!$B$33=\"No\",\"\",Input!$B$33)","v":""},5000,10000,15000,20000,25000,{"$f":"IF(Input!$B$33=\"No\",\"\",Input!$B$33)","v":""}]
[null,"Yellow Edge Line","40 mil",{"$f":"'Intermediate Factor Output'!C9","v":1},{"$f":"'Intermediate Factor Output'!D9","v":1.0061440115879521},{"$f":"'Intermediate Factor Output'!E9","v":1.0412365701171009},{"$f":"'Intermediate Factor Output'!F9","v":1.1957938660380694},{"$f":"'Intermediate Factor Output'!G9","v":2.1230795926955839},{"$f":"'Intermediate Factor Output'!H9","v":""},{"$f":"'Intermediate Factor Output'!I9","v":1},{"$f":"'Intermediate Factor Output'!J9","v":1.0060529616507945},{"$f":"'Intermediate Factor Output'!K9","v":1.0290776139465201},{"$f":"'Intermediate Factor Output'!L9","v":1.0604477355372266},{"$f":"'Intermediate Factor Output'!M9","v":1.1024901457870917},{"$f":"'Intermediate Factor Output'!N9","v":""}]
[null,null,"90 mil",{"$f":"'Intermediate Factor Output'!C10","v":1},{"$f":"'Intermediate Factor Output'!D10","v":1},{"$f":"'Intermediate Factor Output'!E10","v":1},{"$f":"'Intermediate Factor Output'!F10","v":1},{"$f":"'Intermediate Factor Output'!G10","v":1},{"$f":"'Intermediate Factor Output'!H10","v":""},{"$f":"'Intermediate Factor Output'!I10","v":1},{"$f":"'Intermediate Factor Output'!J10","v":1},{"$f":"'Intermediate Factor Output'!K10","v":1},{"$f":"'Intermediate Factor Output'!L10","v":1},{"$f":"'Intermediate Factor Output'!M10","v":1},{"$f":"'Intermediate Factor Output'!N10","v":""}]
[null,null,"Tape",{"$f":"'Intermediate Factor Output'!C11","v":1},{"$f":"'Intermediate Factor Output'!D11","v":1},{"$f":"'Intermediate Factor Output'!E11","v":1},{"$f":"'Intermediate Factor Output'!F11","v":1},{"$f":"'Intermediate Factor Output'!G11","v":1},{"$f":"'Intermediate Factor Output'!H11","v":""},{"$f":"'Intermediate Factor Output'!I11","v":1},{"$f":"'Intermediate Factor Output'!J11","v":1},{"$f":"'Intermediate Factor Output'!K11","v":1},{"$f":"'Intermediate Factor Output'!L11","v":1},{"$f":"'Intermediate Factor Output'!M11","v":1},{"$f":"'Intermediate Factor Output'!N11","v":""}]
[null,null,"Inverted",{"$f":"'Intermediate Factor Output'!C12","v":1},{"$f":"'Intermediate Factor Output'!D12","v":1},{"$f":"'Intermediate Factor Output'!E12","v":1},{"$f":"'Intermediate Factor Output'!F12","v":1},{"$f":"'Intermediate Factor Output'!G12","v":1},{"$f":"'Intermediate Factor Output'!H12","v":""},{"$f":"'Intermediate Factor Output'!I12","v":1},{"$f":"'Intermediate Factor Output'!J12","v":1},{"$f":"'Intermediate Factor Output'!K12","v":1},{"$f":"'Intermediate Factor Output'!L12","v":1},{"$f":"'Intermediate Factor Output'!M12","v":1},{"$f":"'Intermediate Factor Output'!N12","v":""}]
[null,"White Edge Line","40 mil",{"$f":"'Intermediate Factor Output'!C30","v":1},{"$f":"'Intermediate Factor Output'!D30","v":1},{"$f":"'Intermediate Factor Output'!E30","v":1},{"$f":"'Intermediate Factor Output'!F30","v":1},{"$f":"'Intermediate Factor Output'!G30","v":1},{"$f":"'Intermediate Factor Output'!H30","v":""},{"$f":"'Intermediate Factor Output'!I30","v":1},{"$f":"'Intermediate Factor Output'!J30","v":1},{"$f":"'Intermediate Factor Output'!K30","v":1},{"$f":"'Intermediate Factor Output'!L30","v":1},{"$f":"'Intermediate Factor Output'!M30","v":1},{"$f":"'Intermediate Factor Output'!N30","v":""}]
[null,null,"90 mil",{"$f":"'Intermediate Factor Output'!C31","v":1},{"$f":"'Intermediate Factor Output'!D31","v":1},{"$f":"'Intermediate Factor Output'!E31","v":1},{"$f":"'Intermediate Factor Output'!F31","v":1},{"$f":"'Intermediate Factor Output'!G31","v":1},{"$f":"'Intermediate Factor Output'!H31","v":""},{"$f":"'Intermediate Factor Output'!I31","v":1},{"$f":"'Intermediate Factor Output'!J31","v":1},{"$f":"'Intermediate Factor Output'!K31","v":1},{"$f":"'Intermediate Factor Output'!L31","v":1},{"$f":"'Intermediate Factor Output'!M31","v":1},{"$f":"'Intermediate Factor Output'!N31","v":""}]
[null,null,"Tape",{"$f":"'Intermediate Factor Output'!C32","v":1},{"$f":"'Intermediate Factor Output'!D32","v":1},{"$f":"'Intermediate Factor Output'!E32","v":1},{"$f":"'Intermediate Factor Output'!F32","v":1},{"$f":"'Intermediate Factor Output'!G32","v":1},{"$f":"'Intermediate Factor Output'!H32","v":""},{"$f":"'Intermediate Factor Output'!I32","v":1},{"$f":"'Intermediate Factor Output'!J32","v":1},{"$f":"'Intermediate Factor Output'!K32","v":1},{"$f":"'Intermediate Factor Output'!L32","v":1},{"$f":"'Intermediate Factor Output'!M32","v":1},{"$f":"'Intermediate Factor Output'!N32","v":""}]
[null,null,"Inverted",{"$f":"'Intermediate Factor Output'!C33","v":1},{"$f":"'Intermediate Factor Output'!D33","v":1},{"$f":"'Intermediate Factor Output'!E33","v":1},{"$f":"'Intermediate Factor Output'!F33","v":1.5589918631002146},{"$f":"'Intermediate Factor Output'!G33","v":11.19418836617262},{"$f":"'Intermediate Factor Output'!H33","v":""},{"$f":"'Intermediate Factor Output'!I33","v":1},{"$f":"'Intermediate Factor Output'!J33","v":1},{"$f":"'Intermediate Factor Output'!K33","v":1},{"$f":"'Intermediate Factor Output'!L33","v":1.2353456297027765},{"$f":"'Intermediate Factor Output'!M33","v":2.4388266962374989},{"$f":"'Intermediate Factor Output'!N33","v":""}]
[null,"White Lane Line","40 mil",{"$f":"'Intermediate Factor Output'!C51","v":1},{"$f":"'Intermediate Factor Output'!D51","v":1},{"$f":"'Intermediate Factor Output'!E51","v":1},{"$f":"'Intermediate Factor Output'!F51","v":1},{"$f":"'Intermediate Factor Output'!G51","v":1},{"$f":"'Intermediate Factor Output'!H51","v":""},{"$f":"'Intermediate Factor Output'!I51","v":1},{"$f":"'Intermediate Factor Output'!J51","v":1},{"$f":"'Intermediate Factor Output'!K51","v":1},{"$f":"'Intermediate Factor Output'!L51","v":1},{"$f":"'Intermediate Factor Output'!M51","v":1},{"$f":"'Intermediate Factor Output'!N51","v":""}]
[null,null,"90 mil",{"$f":"'Intermediate Factor Output'!C52","v":1},{"$f":"'Intermediate Factor Output'!D52","v":1},{"$f":"'Intermediate Factor Output'!E52","v":1},{"$f":"'Intermediate Factor Output'!F52","v":1},{"$f":"'Intermediate Factor Output'!G52","v":1},{"$f":"'Intermediate Factor Output'!H52","v":""},{"$f":"'Intermediate Factor Output'!I52","v":1},{"$f":"'Intermediate Factor Output'!J52","v":1},{"$f":"'Intermediate Factor Output'!K52","v":1},{"$f":"'Intermediate Factor Output'!L52","v":1},{"$f":"'Intermediate Factor Output'!M52","v":1},{"$f":"'Intermediate Factor Output'!N52","v":""}]
[null,null,"Tape",{"$f":"'Intermediate Factor Output'!C53","v":1},{"$f":"'Intermediate Factor Output'!D53","v":1},{"$f":"'Intermediate Factor Output'!E53","v":1},{"$f":"'Intermediate Factor Output'!F53","v":1},{"$f":"'Intermediate Factor Output'!G53","v":1},{"$f":"'Intermediate Factor Output'!H53","v":""},{"$f":"'Intermediate Factor Output'!I53","v":1},{"$f":"'Intermediate Factor Output'!J53","v":1},{"$f":"'Intermediate Factor Output'!K53","v":1},{"$f":"'Intermediate Factor Output'!L53","v":1},{"$f":"'Intermediate Factor Output'!M53","v":1},{"$f":"'Intermediate Factor Output'!N53","v":""}]
[null,null,"Inverted",{"$f":"'Intermediate Factor Output'!C54","v":1},{"$f":"'Intermediate Factor Output'!D54","v":1},{"$f":"'Intermediate Factor Output'!E54","v":1},{"$f":"'Intermediate Factor Output'!F54","v":1.6749316429074772},{"$f":"'Intermediate Factor Output'!G54","v":14.339195108351021},{"$f":"'Intermediate Factor Output'!H54","v":""},{"$f":"'Intermediate Factor Output'!I54","v":1},{"$f":"'Intermediate Factor Output'!J54","v":1},{"$f":"'Intermediate Factor Output'!K54","v":1},{"$f":"'Intermediate Factor Output'!L54","v":1.2358912334502177},{"$f":"'Intermediate Factor Output'!M54","v":2.4621603220560568},{"$f":"'Intermediate Factor Output'!N54","v":""}]
[]
[]
[null,"Line Type","Material","Off-Peak Application",null,null,null,null,null,"Night Time Application"]
[null,null,null,"ADT per Lane",null,null,null,null,"User ADT","ADT per Lane",null,null,null,null,"User ADT"]
[null,"Line Type",null,5000,10000,15000,20000,25000,{"$f":"IF(Input!$B$33=\"No\",\"\",Input!$B$33)","v":""},5000,10000,15000,20000,25000,{"$f":"IF(Input!$B$33=\"No\",\"\",Input!$B$33)","v":""}]
[null,"Yellow Edge Line","40 mil",{"$f":"'Intermediate Factor Output'!C13","v":1},{"$f":"'Intermediate Factor Output'!D13","v":1.0060939617391254},{"$f":"'Intermediate Factor Output'!E13","v":1.0359732670459338},{"$f":"'Intermediate Factor Output'!F13","v":1.1342720166585465},{"$f":"'Intermediate Factor Output'!G13","v":2.1221927786395787},{"$f":"'Intermediate Factor Output'!H13","v":""},{"$f":"'Intermediate Factor Output'!I13","v":1},{"$f":"'Intermediate Factor Output'!J13","v":1.0060414261830659},{"$f":"'Intermediate Factor Output'!K13","v":1.0289931924116547},{"$f":"'Intermediate Factor Output'!L13","v":1.0602077522704769},{"$f":"'Intermediate Factor Output'!M13","v":1.0995794092528457},{"$f":"'Intermediate Factor Output'!N13","v":""}]
[null,null,"90 mil",{"$f":"'Intermediate Factor Output'!C14","v":1},{"$f":"'Intermediate Factor Output'!D14","v":1},{"$f":"'Intermediate Factor Output'!E14","v":1},{"$f":"'Intermediate Factor Output'!F14","v":1},{"$f":"'Intermediate Factor Output'!G14","v":1},{"$f":"'Intermediate Factor Output'!H14","v":""},{"$f":"'Intermediate Factor Output'!I14","v":1},{"$f":"'Intermediate Factor Output'!J14","v":1},{"$f":"'Intermediate Factor Output'!K14","v":1},{"$f":"'Intermediate Factor Output'!L14","v":1},{"$f":"'Intermediate Factor Output'!M14","v":1},{"$f":"'Intermediate Factor Output'!N14","v":""}]
[null,null,"Tape",{"$f":"'Intermediate Factor Output'!C15","v":1},{"$f":"'Intermediate Factor Output'!D15","v":1},{"$f":"'Intermediate Factor Output'!E15","v":1},{"$f":"'Intermediate Factor Output'!F15","v":1},{"$f":"'Intermediate Factor Output'!G15","v":1},{"$f":"'Intermediate Factor Output'!H15","v":""},{"$f":"'Intermediate Factor Output'!I15","v":1},{"$f":"'Intermediate Factor Output'!J15","v":1},{"$f":"'Intermediate Factor Output'!K15","v":1},{"$f":"'Intermediate Factor Output'!L15","v":1},{"$f":"'Intermediate Factor Output'!M15","v":1},{"$f":"'Intermediate Factor Output'!N15","v":""}]
[null,null,"Inverted",{"$f":"'Intermediate Factor Output'!C16","v":1},{"$f":"'Intermediate Factor Output'!D16","v":1},{"$f":"'Intermediate Factor Output'!E16","v":1},{"$f":"'Intermediate Factor Output'!F16","v":1},{"$f":"'Intermediate Factor Output'!G16","v":1},{"$f":"'Intermediate Factor Output'!H16","v":""},{"$f":"'Intermediate Factor Output'!I16","v":1},{"$f":"'Intermediate Factor Output'!J16","v":1},{"$f":"'Intermediate Factor Output'!K16","v":1},{"$f":"'Intermediate Factor Output'!L16","v":1},{"$f":"'Intermediate Factor Output'!M16","v":1},{"$f":"'Intermediate Factor Output'!N16","v":""}]
[null,"White Edge Line","40 mil",{"$f":"'Intermediate Factor Output'!C34","v":1},{"$f":"'Intermediate Factor Output'!D34","v":1},{"$f":"'Intermediate Factor Output'!E34","v":1},{"$f":"'Intermediate Factor Output'!F34","v":1},{"$f":"'Intermediate Factor Output'!G34","v":1},{"$f":"'Intermediate Factor Output'!H34","v":""},{"$f":"'Intermediate Factor Output'!I34","v":1},{"$f":"'Intermediate Factor Output'!J34","v":1},{"$f":"'Intermediate Factor Output'!K34","v":1},{"$f":"'Intermediate Factor Output'!L34","v":1},{"$f":"'Intermediate Factor Output'!M34","v":1},{"$f":"'Intermediate Factor Output'!N34","v":""}]
[null,null,"90 mil",{"$f":"'Intermediate Factor Output'!C35","v":1},{"$f":"'Intermediate Factor Output'!D35","v":1},{"$f":"'Intermediate Factor Output'!E35","v":1},{"$f":"'Intermediate Factor Output'!F35","v":1},{"$f":"'Intermediate Factor Output'!G35","v":1},{"$f":"'Intermediate Factor Output'!H35","v":""},{"$f":"'Intermediate Factor Output'!I35","v":1},{"$f":"'Intermediate Factor Output'!J35","v":1},{"$f":"'Intermediate Factor Output'!K35","v":1},{"$f":"'Intermediate Factor Output'!L35","v":1},{"$f":"'Intermediate Factor Output'!M35","v":1},{"$f":"'Intermediate Factor Output'!N35","v":""}]
[null,null,"Tape",{"$f":"'Intermediate Factor Output'!C36","v":1},{"$f":"'Intermediate Factor Output'!D36","v":1},{"$f":"'Intermediate Factor Output'!E36","v":1},{"$f":"'Intermediate Factor Output'!F36","v":1},{"$f":"'Intermediate Factor Output'!G36","v":1},{"$f":"'Intermediate Factor Output'!H36","v":""},{"$f":"'Intermediate Factor Output'!I36","v":1},{"$f":"'Intermediate Factor Output'!J36","v":1},{"$f":"'Intermediate Factor Output'!K36","v":1},{"$f":"'Intermediate Factor Output'!L36","v":1},{"$f":"'Intermediate Factor Output'!M36","v":1},{"$f":"'Intermediate Factor Output'!N36","v":""}]
[null,null,"Inverted",{"$f":"'Intermediate Factor Output'!C37","v":1},{"$f":"'Intermediate Factor Output'!D37","v":1},{"$f":"'Intermediate Factor Output'!E37","v":1},{"$f":"'Intermediate Factor Output'!F37","v":1.5589918631002146},{"$f":"'Intermediate Factor Output'!G37","v":11.19418836617262},{"$f":"'Intermediate Factor Output'!H37","v":""},{"$f":"'Intermediate Factor Output'!I37","v":1},{"$f":"'Intermediate Factor Output'!J37","v":1},{"$f":"'Intermediate Factor Output'!K37","v":1},{"$f":"'Intermediate Factor Output'!L37","v":1.2353040911345419},{"$f":"'Intermediate Factor Output'!M37","v":2.4388266962374989},{"$f":"'Intermediate Factor Output'!N37","v":""}]
[null,"White Lane Line","40 mil",{"$f":"'Intermediate Factor Output'!C55","v":1},{"$f":"'Intermediate Factor Output'!D55","v":1},{"$f":"'Intermediate Factor Output'!E55","v":1},{"$f":"'Intermediate Factor Output'!F55","v":1},{"$f":"'Intermediate Factor Output'!G55","v":1},{"$f":"'Intermediate Factor Output'!H55","v":""},{"$f":"'Intermediate Factor Output'!I55","v":1},{"$f":"'Intermediate Factor Output'!J55","v":1},{"$f":"'Intermediate Factor Output'!K55","v":1},{"$f":"'Intermediate Factor Output'!L55","v":1},{"$f":"'Intermediate Factor Output'!M55","v":1},{"$f":"'Intermediate Factor Output'!N55","v":""}]
[null,null,"90 mil",{"$f":"'Intermediate Factor Output'!C56","v":1},{"$f":"'Intermediate Factor Output'!D56","v":1},{"$f":"'Intermediate Factor Output'!E56","v":1},{"$f":"'Intermediate Factor Output'!F56","v":1},{"$f":"'Intermediate Factor Output'!G56","v":1},{"$f":"'Intermediate Factor Output'!H56","v":""},{"$f":"'Intermediate Factor Output'!I56","v":1},{"$f":"'Intermediate Factor Output'!J56","v":1},{"$f":"'Intermediate Factor Output'!K56","v":1},{"$f":"'Intermediate Factor Output'!L56","v":1},{"$f":"'Intermediate Factor Output'!M56","v":1},{"$f":"'Intermediate Factor Output'!N56","v":""}]
[null,null,"Tape",{"$f":"'Intermediate Factor Output'!C57","v":1},{"$f":"'Intermediate Factor Output'!D57","v":1},{"$f":"'Intermediate Factor Output'!E57","v":1},{"$f":"'Intermediate Factor Output'!F57","v":1},{"$f":"'Intermediate Factor Output'!G57","v":1},{"$f":"'Intermediate Factor Output'!H57","v":""},{"$f":"'Intermediate Factor Output'!I57","v":1},{"$f":"'Intermediate Factor Output'!J57","v":1},{"$f":"'Intermediate Factor Output'!K57","v":1},{"$f":"'Intermediate Factor Output'!L57","v":1},{"$f":"'Intermediate Factor Output'!M57","v":1},{"$f":"'Intermediate Factor Output'!N57","v":""}]
[null,null,"Inverted",{"$f":"'Intermediate Factor Output'!C58","v":1},{"$f":"'Intermediate Factor Output'!D58","v":1},{"$f":"'Intermediate Factor Output'!E58","v":1},{"$f":"'Intermediate Factor Output'!F58","v":1.6749316429074772},{"$f":"'Intermediate Factor Output'!G58","v":14.339195108351021},{"$f":"'Intermediate Factor Output'!H58","v":""},{"$f":"'Intermediate Factor Output'!I58","v":1},{"$f":"'Intermediate Factor Output'!J58","v":1},{"$f":"'Intermediate Factor Output'!K58","v":1},{"$f":"'Intermediate Factor Output'!L58","v":1.2358912334502177},{"$f":"'Intermediate Factor Output'!M58","v":2.4621603220560568},{"$f":"'Intermediate Factor Output'!N58","v":""}]
[]
[]
[null,"Line Type","Material","Off-Peak Application",null,null,null,null,null,"Night Time Application"]
[null,null,null,"ADT per Lane",null,null,null,null,"User ADT","ADT per Lane",null,null,null,null,"User ADT"]
[null,"Line Type",null,5000,10000,15000,20000,25000,{"$f":"IF(Input!$B$33=\"No\",\"\",Input!$B$33)","v":""},5000,10000,15000,20000,25000,{"$f":"IF(Input!$B$33=\"No\",\"\",Input!$B$33)","v":""}]
[null,"Yellow Edge Line","40 mil",{"$f":"'Intermediate Factor Output'!C17","v":1},{"$f":"'Intermediate Factor Output'!D17","v":1.006112381289566},{"$f":"'Intermediate Factor Output'!E17","v":1.0379041507780515},{"$f":"'Intermediate Factor Output'!F17","v":1.1561638614608403},{"$f":"'Intermediate Factor Output'!G17","v":2.1230795926955839},{"$f":"'Intermediate Factor Output'!H17","v":""},{"$f":"'Intermediate Factor Output'!I17","v":1},{"$f":"'Intermediate Factor Output'!J17","v":1.006045671615867},{"$f":"'Intermediate Factor Output'!K17","v":1.0290242609367377},{"$f":"'Intermediate Factor Output'!L17","v":1.0602960620396664},{"$f":"'Intermediate Factor Output'!M17","v":1.1006488750112313},{"$f":"'Intermediate Factor Output'!N17","v":""}]
[null,null,"90 mil",{"$f":"'Intermediate Factor Output'!C18","v":1},{"$f":"'Intermediate Factor Output'!D18","v":1},{"$f":"'Intermediate Factor Output'!E18","v":1},{"$f":"'Intermediate Factor Output'!F18","v":1},{"$f":"'Intermediate Factor Output'!G18","v":1},{"$f":"'Intermediate Factor Output'!H18","v":""},{"$f":"'Intermediate Factor Output'!I18","v":1},{"$f":"'Intermediate Factor Output'!J18","v":1},{"$f":"'Intermediate Factor Output'!K18","v":1},{"$f":"'Intermediate Factor Output'!L18","v":1},{"$f":"'Intermediate Factor Output'!M18","v":1},{"$f":"'Intermediate Factor Output'!N18","v":""}]
[null,null,"Tape",{"$f":"'Intermediate Factor Output'!C19","v":1},{"$f":"'Intermediate Factor Output'!D19","v":1},{"$f":"'Intermediate Factor Output'!E19","v":1},{"$f":"'Intermediate Factor Output'!F19","v":1},{"$f":"'Intermediate Factor Output'!G19","v":1},{"$f":"'Intermediate Factor Output'!H19","v":""},{"$f":"'Intermediate Factor Output'!I19","v":1},{"$f":"'Intermediate Factor Output'!J19","v":1},{"$f":"'Intermediate Factor Output'!K19","v":1},{"$f":"'Intermediate Factor Output'!L19","v":1},{"$f":"'Intermediate Factor Output'!M19","v":1},{"$f":"'Intermediate Factor Output'!N19","v":""}]
[null,null,"Inverted",{"$f":"'Intermediate Factor Output'!C20","v":1},{"$f":"'Intermediate Factor Output'!D20","v":1},{"$f":"'Intermediate Factor Output'!E20","v":1},{"$f":"'Intermediate Factor Output'!F20","v":1},{"$f":"'Intermediate Factor Output'!G20","v":1},{"$f":"'Intermediate Factor Output'!H20","v":""},{"$f":"'Intermediate Factor Output'!I20","v":1},{"$f":"'Intermediate Factor Output'!J20","v":1},{"$f":"'Intermediate Factor Output'!K20","v":1},{"$f":"'Intermediate Factor Output'!L20","v":1},{"$f":"'Intermediate Factor Output'!M20","v":1},{"$f":"'Intermediate Factor Output'!N20","v":""}]
[null,"White Edge Line","40 mil",{"$f":"'Intermediate Factor Output'!C38","v":1},{"$f":"'Intermediate Factor Output'!D38","v":1},{"$f":"'Intermediate Factor Output'!E38","v":1},{"$f":"'Intermediate Factor Output'!F38","v":0.64144016634660161},{"$f":"'Intermediate Factor Output'!G38","v":8.9332068327693137E-2},{"$f":"'Intermediate Factor Output'!H38","v":""},{"$f":"'Intermediate Factor Output'!I38","v":1},{"$f":"'Intermediate Factor Output'!J38","v":1},{"$f":"'Intermediate Factor Output'!K38","v":1},{"$f":"'Intermediate Factor Output'!L38","v":0.80949005359787407},{"$f":"'Intermediate Factor Output'!M38","v":0.41003323505632872},{"$f":"'Intermediate Factor Output'!N38","v":""}]
[null,null,"90 mil",{"$f":"'Intermediate Factor Output'!C39","v":1},{"$f":"'Intermediate Factor Output'!D39","v":1},{"$f":"'Intermediate Factor Output'!E39","v":1},{"$f":"'Intermediate Factor Output'!F39","v":0.64144016634660161},{"$f":"'Intermediate Factor Output'!G39","v":8.9332068327693137E-2},{"$f":"'Intermediate Factor Output'!H39","v":""},{"$f":"'Intermediate Factor Output'!I39","v":1},{"$f":"'Intermediate Factor Output'!J39","v":1},{"$f":"'Intermediate Factor Output'!K39","v":1},{"$f":"'Intermediate Factor Output'!L39","v":0.80949005359787407},{"$f":"'Intermediate Factor Output'!M39","v":0.41003323505632872},{"$f":"'Intermediate Factor Output'!N39","v":""}]
[null,null,"Tape",{"$f":"'Intermediate Factor Output'!C40","v":1},{"$f":"'Intermediate Factor Output'!D40","v":1},{"$f":"'Intermediate Factor Output'!E40","v":1},{"$f":"'Intermediate Factor Output'!F40","v":0.64144016634660161},{"$f":"'Intermediate Factor Output'!G40","v":8.9332068327693137E-2},{"$f":"'Intermediate Factor Output'!H40","v":""},{"$f":"'Intermediate Factor Output'!I40","v":1},{"$f":"'Intermediate Factor Output'!J40","v":1},{"$f":"'Intermediate Factor Output'!K40","v":1},{"$f":"'Intermediate Factor Output'!L40","v":0.80951727366301263},{"$f":"'Intermediate Factor Output'!M40","v":0.41003323505632872},{"$f":"'Intermediate Factor Output'!N40","v":""}]
[null,null,"Inverted",{"$f":"'Intermediate Factor Output'!C41","v":1},{"$f":"'Intermediate Factor Output'!D41","v":1},{"$f":"'Intermediate Factor Output'!E41","v":1},{"$f":"'Intermediate Factor Output'!F41","v":1},{"$f":"'Intermediate Factor Output'!G41","v":1},{"$f":"'Intermediate Factor Output'!H41","v":""},{"$f":"'Intermediate Factor Output'!I41","v":1},{"$f":"'Intermediate Factor Output'!J41","v":1},{"$f":"'Intermediate Factor Output'!K41","v":1},{"$f":"'Intermediate Factor Output'!L41","v":1},{"$f":"'Intermediate Factor Output'!M41","v":1},{"$f":"'Intermediate Factor Output'!N41","v":""}]
[null,"White Lane Line","40 mil",{"$f":"'Intermediate Factor Output'!C59","v":1},{"$f":"'Intermediate Factor Output'!D59","v":1},{"$f":"'Intermediate Factor Output'!E59","v":1},{"$f":"'Intermediate Factor Output'!F59","v":0.59703929066867578},{"$f":"'Intermediate Factor Output'!G59","v":6.973892135811785E-2},{"$f":"'Intermediate Factor Output'!H59","v":""},{"$f":"'Intermediate Factor Output'!I59","v":1},{"$f":"'Intermediate Factor Output'!J59","v":1},{"$f":"'Intermediate Factor Output'!K59","v":1},{"$f":"'Intermediate Factor Output'!L59","v":0.80913269140061472},{"$f":"'Intermediate Factor Output'!M59","v":0.40614739464444699},{"$f":"'Intermediate Factor Output'!N59","v":""}]
[null,null,"90 mil",{"$f":"'Intermediate Factor Output'!C60","v":1},{"$f":"'Intermediate Factor Output'!D60","v":1},{"$f":"'Intermediate Factor Output'!E60","v":1},{"$f":"'Intermediate Factor Output'!F60","v":0.59703929066867578},{"$f":"'Intermediate Factor Output'!G60","v":6.973892135811785E-2},{"$f":"'Intermediate Factor Output'!H60","v":""},{"$f":"'Intermediate Factor Output'!I60","v":1},{"$f":"'Intermediate Factor Output'!J60","v":1},{"$f":"'Intermediate Factor Output'!K60","v":1},{"$f":"'Intermediate Factor Output'!L60","v":0.80913269140061472},{"$f":"'Intermediate Factor Output'!M60","v":0.40614739464444699},{"$f":"'Intermediate Factor Output'!N60","v":""}]
[null,null,"Tape",{"$f":"'Intermediate Factor Output'!C61","v":1},{"$f":"'Intermediate Factor Output'!D61","v":1},{"$f":"'Intermediate Factor Output'!E61","v":1},{"$f":"'Intermediate Factor Output'!F61","v":0.59703929066867578},{"$f":"'Intermediate Factor Output'!G61","v":6.973892135811785E-2},{"$f":"'Intermediate Factor Output'!H61","v":""},{"$f":"'Intermediate Factor Output'!I61","v":1},{"$f":"'Intermediate Factor Output'!J61","v":1},{"$f":"'Intermediate Factor Output'!K61","v":1},{"$f":"'Intermediate Factor Output'!L61","v":0.80913269140061472},{"$f":"'Intermediate Factor Output'!M61","v":0.40614739464444699},{"$f":"'Intermediate Factor Output'!N61","v":""}]
[null,null,"Inverted",{"$f":"'Intermediate Factor Output'!C62","v":1},{"$f":"'Intermediate Factor Output'!D62","v":1},{"$f":"'Intermediate Factor Output'!E62","v":1},{"$f":"'Intermediate Factor Output'!F62","v":1},{"$f":"'Intermediate Factor Output'!G62","v":1},{"$f":"'Intermediate Factor Output'!H62","v":""},{"$f":"'Intermediate Factor Output'!I62","v":1},{"$f":"'Intermediate Factor Output'!J62","v":1},{"$f":"'Intermediate Factor Output'!K62","v":1},{"$f":"'Intermediate Factor Output'!L62","v":1},{"$f":"'Intermediate Factor Output'!M62","v":1},{"$f":"'Intermediate Factor Output'!N62","v":""}]